BDBM264262 6-(2,6-Dichlorophenyl)-2-((4-(2-(methylamino)ethoxy)phenyl)amino)pyrido[4,3-d]pyrimidin-5(6H)-one, HCl::US9714244, 16
SMILES CNCCOc1ccc(Nc2ncc3c(ccn(-c4c(Cl)cccc4Cl)c3=O)n2)cc1
InChI Key InChIKey=QKLHATQBUALPMQ-UHFFFAOYSA-N
Data  2 IC50
  Tab Delimited (TSV)   2D SDfile   Computed 3D by Vconf -m prep SDfile
Find this compound or compounds like it in BindingDB:
Activity Spreadsheet -- Enzyme Inhibition Constant Data from BindingDB
Found 2 hits for monomerid = 264262
TargetPotassium voltage-gated channel subfamily H member 2(Homo sapiens (Human))
Almac Discovery
US Patent
LigandPNGBDBM264262(6-(2,6-Dichlorophenyl)-2-((4-(2-(methylamino)ethox...)
Affinity DataIC50: <10nM. Assay description: Compounds were tested for inhibition of the human ether a go-go related gene (hERG) K+ channel using IonWorks patch clamp electrophysiology at Essen ...
Ligand InfoPC cidPC sid
In DepthDetails US Patent
TargetWee1-like protein kinase(Homo sapiens (Human))
Almac Discovery
US Patent
LigandPNGBDBM264262(6-(2,6-Dichlorophenyl)-2-((4-(2-(methylamino)ethox...)
Affinity DataIC50:  5.50E+3nMT: 2°C. Assay description: In the measurement of Wee-1 activity, a commercial peptide Poly(Lys Tyr(4:1)) hydrobromide was purchased from Sigma Aldrich and used as the substrate...
Ligand InfoPC cidPC sid
In DepthDetails US Patent