BDBM264263 6-(2,6-Dichlorophenyl)-2-((4-(4-isopropylpiperazin-1-yl)phenyl)amino)pyrido[4,3-d]pyrimidin-5(6H)-one::US9714244, 17
SMILES CC(C)N1CCN(CC1)c1ccc(Nc2ncc3c(ccn(-c4c(Cl)cccc4Cl)c3=O)n2)cc1
InChI Key InChIKey=XYGHHOLKBZVZNC-UHFFFAOYSA-N
Data  2 IC50
  Tab Delimited (TSV)   2D SDfile   Computed 3D by Vconf -m prep SDfile
Find this compound or compounds like it in BindingDB:
Activity Spreadsheet -- Enzyme Inhibition Constant Data from BindingDB
Found 2 hits for monomerid = 264263
TargetPotassium voltage-gated channel subfamily H member 2(Homo sapiens (Human))
Almac Discovery
US Patent
LigandPNGBDBM264263(6-(2,6-Dichlorophenyl)-2-((4-(4-isopropylpiperazin...)
Affinity DataIC50:  105nM. Assay description: Compounds were tested for inhibition of the human ether a go-go related gene (hERG) K+ channel using IonWorks patch clamp electrophysiology at Essen ...
Ligand InfoPC cidPC sid
In DepthDetails US Patent
TargetWee1-like protein kinase(Homo sapiens (Human))
Almac Discovery
US Patent
LigandPNGBDBM264263(6-(2,6-Dichlorophenyl)-2-((4-(4-isopropylpiperazin...)
Affinity DataIC50:  5.50E+3nMT: 2°C. Assay description: In the measurement of Wee-1 activity, a commercial peptide Poly(Lys Tyr(4:1)) hydrobromide was purchased from Sigma Aldrich and used as the substrate...
Ligand InfoPC cidPC sid
In DepthDetails US Patent