BDBM267513 4-(8-amino-3-((cis)-4-methoxycyclohexyl)imidazo [1,5-a]pyrazin-1-yl)-N-(4-cyanopyridin-2-yl)benzamide::US9718828, Example, 42
SMILES CCCc1ccnc(NC(=O)c2ccc(cc2)-c2nc([C@@H]3CC[C@@H](CC3)OC)n3ccnc(N)c23)c1
InChI Key InChIKey=FSKCBJSJSQJTBE-GRGXKFILSA-N
Data  1 EC50
  Tab Delimited (TSV)   2D SDfile   Computed 3D by Vconf -m prep SDfile
Find this compound or compounds like it in BindingDB:
Activity Spreadsheet -- Enzyme Inhibition Constant Data from BindingDB
Found 1 hit for monomerid = 267513
TargetTyrosine-protein kinase BTK(Homo sapiens (Human))
Merck Sharp & Dohme
US Patent
LigandPNGBDBM267513(4-(8-amino-3-((cis)-4-methoxycyclohexyl)imidazo [1...)
Affinity DataEC50: <10nMpH: 7.2 T: 2°C. Assay description: Btk enzyme activity is measured using the IMAP (immobilized metal ion affinity-based fluorescence polarization) assay as outlined below. Btk enzyme (...
Ligand InfoPC cidPC sid
In DepthDetails US Patent