BDBM268719 US9718825, Example 121::US9718825, Example 122
SMILES Cc1ccc(F)c(c1)S(=O)(=O)Nc1ccc(cc1)-c1nc(OCc2cn[nH]c2)c2cn[nH]c2n1
InChI Key InChIKey=HSCUPHGLKOXBPF-UHFFFAOYSA-N
Data  2 IC50
  Tab Delimited (TSV)   2D SDfile   Computed 3D by Vconf -m prep SDfile
Find this compound or compounds like it in BindingDB:
Activity Spreadsheet -- Enzyme Inhibition Constant Data from BindingDB
Found 2 hits for monomerid = 268719
TargetSerine/threonine-protein kinase Sgk1(Homo sapiens (Human))
Sanofi
US Patent
LigandPNGBDBM268719(US9718825, Example 121 | US9718825, Example 122)
Affinity DataIC50: <1.5nMpH: 7.4Assay Description:The compounds were tested for serum and glucocorticoid-regulated kinase 1 (SGK-1) inhibitory activity in a substrate phosphorylation assay designed t...
Ligand InfoPC cidPC sid
In DepthDetails US Patent
TargetSerine/threonine-protein kinase Sgk1(Homo sapiens (Human))
Sanofi
US Patent
LigandPNGBDBM268719(US9718825, Example 121 | US9718825, Example 122)
Affinity DataIC50: <1.5nMpH: 7.4Assay Description:The compounds were tested for serum and glucocorticoid-regulated kinase 1 (SGK-1) inhibitory activity in a substrate phosphorylation assay designed t...
Ligand InfoPC cidPC sid
In DepthDetails US Patent