BDBM268859 US9718825, Example 264
SMILES Cc1ccc(F)c(c1)S(=O)(=O)Nc1ccc(cc1)-c1nc(OC2CCCNC2)c2cn[nH]c2n1
InChI Key
Data  1 IC50
  Tab Delimited (TSV)   2D SDfile   Computed 3D by Vconf -m prep SDfile
Find this compound or compounds like it in BindingDB:
Activity Spreadsheet -- Enzyme Inhibition Constant Data from BindingDB
Found 1 hit for monomerid = 268859
TargetSerine/threonine-protein kinase Sgk1(Homo sapiens (Human))
Sanofi
US Patent
LigandPNGBDBM268859(US9718825, Example 264)
Affinity DataIC50:  1.20nMpH: 7.4Assay Description:The compounds were tested for serum and glucocorticoid-regulated kinase 1 (SGK-1) inhibitory activity in a substrate phosphorylation assay designed t...
Ligand InfoPC cidPC sid
In DepthDetails US Patent