BDBM269254 US10071086, Compound 1
SMILES Fc1cccc(c1)-c1cncc2[nH]c(nc12)-c1n[nH]c2ncc(cc12)-c1cncc(NC(=O)C(F)(F)F)c1
InChI Key InChIKey=OEUFBODWYGAVOE-UHFFFAOYSA-N
Data  1 IC50
  Tab Delimited (TSV)   2D SDfile   Computed 3D by Vconf -m prep SDfile
Find this compound or compounds like it in BindingDB:
Activity Spreadsheet -- Enzyme Inhibition Constant Data from BindingDB
Found 1 hit for monomerid = 269254
TargetAdenomatous polyposis coli protein(Homo sapiens (Human))
Samumed
US Patent
LigandPNGBDBM269254(US10071086, Compound 1)
Affinity DataIC50:  6nM. Assay description: Reporter cell lines can be generated by stably transducing cells of cancer cell lines (e.g., colon cancer) with a lentiviral construct that include a...
Ligand InfoPC cidPC sid
In DepthDetails US Patent