BDBM269263 US10071086, Compound 11
SMILES CN1CCN(CC1)c1cc(F)cc(c1)-c1cncc2[nH]c(nc12)-c1n[nH]c2ncc(cc12)-c1cccnc1
InChI Key InChIKey=WMEDEBADCHNVEO-UHFFFAOYSA-N
Data  2 IC50
  Tab Delimited (TSV)   2D SDfile   Computed 3D by Vconf -m prep SDfile
Find this compound or compounds like it in BindingDB:
Activity Spreadsheet -- Enzyme Inhibition Constant Data from BindingDB
Found 2 hits for monomerid = 269263
TargetBeta-catenin-interacting protein 1(Homo sapiens (Human))
Samumed
US Patent
LigandPNGBDBM269263(US10071086, Compound 11)
Affinity DataIC50:  210nM. Assay description: Compounds of Formulas (I) or (II) were screened in a β-catenin-based reporter assay in a transformed human bronchial epithelial cell line (NL-20...
Ligand InfoPC cidPC sid
In DepthDetails US Patent
TargetAdenomatous polyposis coli protein(Homo sapiens (Human))
Samumed
US Patent
LigandPNGBDBM269263(US10071086, Compound 11)
Affinity DataIC50:  99nM. Assay description: Reporter cell lines can be generated by stably transducing cells of cancer cell lines (e.g., colon cancer) with a lentiviral construct that include a...
Ligand InfoPC cidPC sid
In DepthDetails US Patent