BDBM27104 2-(1-propylazetidin-3-yl)-1H-1,3-benzodiazole-4-carboxamide::cyclic amine-containing benzimidazole carboxamide, 4a
SMILES CCCN1CC(C1)c1nc2cccc(C(N)=O)c2[nH]1
InChI Key InChIKey=CCQGGHBBNRXBIY-UHFFFAOYSA-N
Data  1 KI
  Tab Delimited (TSV)   2D SDfile   Computed 3D by Vconf -m prep SDfile
Find this compound or compounds like it in BindingDB:
Activity Spreadsheet -- Enzyme Inhibition Constant Data from BindingDB
Found 1 hit for monomerid = 27104
TargetPoly [ADP-ribose] polymerase 1(Homo sapiens (Human))
Abbott Laboratories
LigandPNGBDBM27104(2-(1-propylazetidin-3-yl)-1H-1,3-benzodiazole-4-ca...)
Affinity DataKi:  17nM ΔG°:  -10.5kcal/molepH: 8.0 T: 2°C. Assay description: PARP assays utilizing SPA bead-based detection were carried out in 96-well plates. After reaction was terminated, the reaction mixtures were transfer...
In DepthDetails ArticlePubMed