BDBM272938 (S)-2-((1-(4-(1H- 1,2,4-triazol-3- yl)phenyl)-7,8,9,10- tetrahydro-6-oxa- 2,10a- diazacycloocta[cd]- inden-4- yl)oxy)propanamide::US10065970, Compound 243::US10435414, Compound 243
SMILES C[C@H](Oc1cc2OCCCCn3c(nc(c1)c23)-c1ccc(cc1)-c1nc[nH]n1)C(N)=O
InChI Key InChIKey=FZEYBLDUYKJAKT-ZDUSSCGKSA-N
Data  2 KI
  Tab Delimited (TSV)   2D SDfile   Computed 3D by Vconf -m prep SDfile
Find this compound or compounds like it in BindingDB:
Activity Spreadsheet -- Enzyme Inhibition Constant Data from BindingDB
Found 2 hits for monomerid = 272938
TargetPhosphatidylinositol 3-kinase regulatory subunit alpha(Homo sapiens (Human))
Genentech
US Patent
LigandPNGBDBM272938((S)-2-((1-(4-(1H- 1,2,4-triazol-3- yl)phenyl)-7,8,...)
Affinity DataKi: <0.0200nM. Assay description: TBD
Ligand InfoPC cidPC sid
In DepthDetails US Patent
LigandPNGBDBM272938((S)-2-((1-(4-(1H- 1,2,4-triazol-3- yl)phenyl)-7,8,...)
Affinity DataKi: <0.0200nM. Assay description: PI3K Binding assays are intended for determining the biochemical potency of small molecule PI3K inhibitors. The PI3K lipid kinase reaction is perform...
Ligand InfoPC cidPC sid
In DepthDetails US Patent