BDBM27448 5-(5,6-dimethoxy-1H-1,3-benzodiazol-1-yl)-3-{[2-(trifluoromethyl)phenyl]methoxy}thiophene-2-carbonitrile::BMCL191018 Compound 53::benzimidazole-thiophene carbonitrile, 12a
SMILES COc1cc2ncn(-c3cc(OCc4ccccc4C(F)(F)F)c(s3)C#N)c2cc1OC
InChI Key InChIKey=PYVMYBZZIWFCPE-UHFFFAOYSA-N
Data  2 IC50
  Tab Delimited (TSV)   2D SDfile   Computed 3D by Vconf -m prep SDfile
Find this compound or compounds like it in BindingDB:
Activity Spreadsheet -- Enzyme Inhibition Constant Data from BindingDB
Found 2 hits for monomerid = 27448
LigandPNGBDBM27448(5-(5,6-dimethoxy-1H-1,3-benzodiazol-1-yl)-3-{[2-(t...)
Affinity DataIC50:  251nMpH: 7.4 T: 2°C. Assay description: IKK kinase activity was assessed using a time-resolved fluorescence resonance energy transfer (TR-FRET) assay. The reaction was initiated by the addi...
In DepthDetails ArticlePubMed
TargetSerine/threonine-protein kinase PLK1(Homo sapiens (Human))
Gsk
LigandPNGBDBM27448(5-(5,6-dimethoxy-1H-1,3-benzodiazol-1-yl)-3-{[2-(t...)
Affinity DataIC50:  700nM. Assay description: The compound inhibitory activity was determined by incubation with purified PLK enzyme and biotinylated peptide substrate in the presence ATP/[gamma-...
In DepthDetails ArticlePubMed