BDBM274514 US9556179, Compound 84::methyl 4-(5-(2-(2- fluoroisonicotinamido)imidazo[1,2- b]pyridazin-6-yl)-4-(4-fluorophenyl)- 1H-imidazol-1-yl)piperidine-1- carboxylate
SMILES COC(=O)N1CCC(CC1)n1cnc(c1-c1ccc2nc(NC(=O)c3ccnc(F)c3)cn2n1)-c1ccc(F)cc1
InChI Key InChIKey=UEMQWZBFDVAUQH-UHFFFAOYSA-N
Data  2 IC50
  Tab Delimited (TSV)   2D SDfile   Computed 3D by Vconf -m prep SDfile
Find this compound or compounds like it in BindingDB:
Activity Spreadsheet -- Enzyme Inhibition Constant Data from BindingDB
Found 2 hits for monomerid = 274514
TargetCasein kinase I isoform delta(Homo sapiens (Human))
Bristol-Myers Squibb
US Patent
LigandPNGBDBM274514(US9556179, Compound 84 | methyl 4-(5-(2-(2- fluoro...)
Affinity DataIC50:  0.179nMpH: 7.4 T: 2°C. Assay description: The kinase assay was performed in V-bottom 384-well plates. The final assay volume was 30 μl prepared from 15 μl additions of enzyme, subst...
Ligand InfoPC cidPC sid
In DepthDetails US Patent
TargetCasein kinase I isoform epsilon(Homo sapiens (Human))
Bristol-Myers Squibb
US Patent
LigandPNGBDBM274514(US9556179, Compound 84 | methyl 4-(5-(2-(2- fluoro...)
Affinity DataIC50:  0.967nMpH: 7.4 T: 2°C. Assay description: The kinase assay was performed in V-bottom 384-well plates. The final assay volume was 30 μl prepared from 15 μl additions of enzyme, subst...
Ligand InfoPC cidPC sid
In DepthDetails US Patent