BDBM274623 2-(tert-butyl)-N-(6-(2-(4- fluorophenyl)imidazo[1,2-a] pyridin-3-yl)imidazo[1,2-b] pyridazin-2-yl)isonicotinamide::US9556179, Compound 197
SMILES CC(C)(C)c1cc(ccn1)C(=O)Nc1cn2nc(ccc2n1)-c1c(nc2ccccn12)-c1ccc(F)cc1
InChI Key InChIKey=BIXMZJKSDYSJET-UHFFFAOYSA-N
Data  2 IC50
  Tab Delimited (TSV)   2D SDfile   Computed 3D by Vconf -m prep SDfile
Find this compound or compounds like it in BindingDB:
Activity Spreadsheet -- Enzyme Inhibition Constant Data from BindingDB
Found 2 hits for monomerid = 274623
TargetCasein kinase I isoform delta(Homo sapiens (Human))
Bristol-Myers Squibb
US Patent
LigandPNGBDBM274623(2-(tert-butyl)-N-(6-(2-(4- fluorophenyl)imidazo[1,...)
Affinity DataIC50:  2.99nMpH: 7.4 T: 2°C. Assay description: The kinase assay was performed in V-bottom 384-well plates. The final assay volume was 30 μl prepared from 15 μl additions of enzyme, subst...
Ligand InfoPC cidPC sid
In DepthDetails US Patent
TargetCasein kinase I isoform epsilon(Homo sapiens (Human))
Bristol-Myers Squibb
US Patent
LigandPNGBDBM274623(2-(tert-butyl)-N-(6-(2-(4- fluorophenyl)imidazo[1,...)
Affinity DataIC50:  8.98nMpH: 7.4 T: 2°C. Assay description: The kinase assay was performed in V-bottom 384-well plates. The final assay volume was 30 μl prepared from 15 μl additions of enzyme, subst...
Ligand InfoPC cidPC sid
In DepthDetails US Patent