BDBM27893 8-(2,3-dihydro-1H-inden-5-yl)-N-ethyl-2-({4-[2-(4-methylpiperazin-1-yl)ethyl]phenyl}amino)-5-oxo-5H,8H-pyrido[2,3-d]pyrimidine-6-carboxamide::Pyrido[2,3-d]pyrimidin-5-one, 17d
SMILES CCNC(=O)c1cn(-c2ccc3CCCc3c2)c2nc(Nc3ccc(CCN4CCN(C)CC4)cc3)ncc2c1=O
InChI Key InChIKey=XNGDGDIHSVOJPB-UHFFFAOYSA-N
Data  1 IC50
  Tab Delimited (TSV)   2D SDfile   Computed 3D by Vconf -m prep SDfile
Find this compound or compounds like it in BindingDB:
Activity Spreadsheet -- Enzyme Inhibition Constant Data from BindingDB
Found 1 hit for monomerid = 27893
TargetMacrophage colony-stimulating factor 1 receptor(Homo sapiens (Human))
Johnson & Johnson Pharmaceutical
LigandPNGBDBM27893(8-(2,3-dihydro-1H-inden-5-yl)-N-ethyl-2-({4-[2-(4-...)
Affinity DataIC50:  3.20nMpH: 7.5 T: 2°C. Assay description: FMS was assayed using a fluorescence polarization (FP) competition immunoassay that measured FMS phosphorylation of FMS 555-568 peptide at Y561. The ...
In DepthDetails ArticlePubMed