BDBM27895 8-(2,3-dihydro-1H-inden-5-yl)-N-methoxy-2-({4-[2-(4-methylpiperazin-1-yl)ethyl]phenyl}amino)-5-oxo-5H,8H-pyrido[2,3-d]pyrimidine-6-carboxamide::Pyrido[2,3-d]pyrimidin-5-one, 18a
SMILES CONC(=O)c1cn(-c2ccc3CCCc3c2)c2nc(Nc3ccc(CCN4CCN(C)CC4)cc3)ncc2c1=O
InChI Key InChIKey=IUQURQCHOSRPJM-UHFFFAOYSA-N
Data  6 IC50
  Tab Delimited (TSV)   2D SDfile   Computed 3D by Vconf -m prep SDfile
Find this compound or compounds like it in BindingDB:
Activity Spreadsheet -- Enzyme Inhibition Constant Data from BindingDB
Found 6 hits for monomerid = 27895
TargetMacrophage colony-stimulating factor 1 receptor(Homo sapiens (Human))
Johnson & Johnson Pharmaceutical
LigandPNGBDBM27895(8-(2,3-dihydro-1H-inden-5-yl)-N-methoxy-2-({4-[2-(...)
Affinity DataIC50:  0.700nMpH: 7.5 T: 2°C. Assay description: FMS was assayed using a fluorescence polarization (FP) competition immunoassay that measured FMS phosphorylation of FMS 555-568 peptide at Y561. The ...
In DepthDetails ArticlePubMed
TargetReceptor-type tyrosine-protein kinase FLT3(Homo sapiens (Human))
Johnson & Johnson Pharmaceutical
LigandPNGBDBM27895(8-(2,3-dihydro-1H-inden-5-yl)-N-methoxy-2-({4-[2-(...)
Affinity DataIC50:  36nMT: 2°C. Assay description: FLT-3 was assayed using a fluorescence polarization (FP) competition immunoassay that measured FLT-3 phosphorylation of polyGlu4Tyr. The reaction was...
In DepthDetails ArticlePubMed
TargetInsulin receptor(Homo sapiens (Human))
Johnson & Johnson Pharmaceutical
LigandPNGBDBM27895(8-(2,3-dihydro-1H-inden-5-yl)-N-methoxy-2-({4-[2-(...)
Affinity DataIC50:  1.98E+4nMT: 2°C. Assay description: IRKbeta was assayed using a fluorescence polarization (FP) competition immunoassay that measured IRKbeta phosphorylation of polyGlu4Tyr. The reaction...
In DepthDetails ArticlePubMed
TargetHigh affinity nerve growth factor receptor [440-796](Homo sapiens (Human))
Johnson & Johnson Pharmaceutical
LigandPNGBDBM27895(8-(2,3-dihydro-1H-inden-5-yl)-N-methoxy-2-({4-[2-(...)
Affinity DataIC50: >500nMT: 2°C. Assay description: TrkA was assayed using a fluorescence polarization (FP) competition immunoassay that measured TrkA phosphorylation of polyGlu4Tyr. The reaction was i...
In DepthDetails ArticlePubMed
TargetMast/stem cell growth factor receptor Kit(Homo sapiens (Human))
Johnson & Johnson Pharmaceutical
LigandPNGBDBM27895(8-(2,3-dihydro-1H-inden-5-yl)-N-methoxy-2-({4-[2-(...)
Affinity DataIC50:  6nMT: 2°C. Assay description: KIT was assayed using a fluorescence polarization (FP) competition immunoassay that measured KIT phosphorylation of polyGlu4Tyr. The reaction was ini...
In DepthDetails ArticlePubMed
TargetTyrosine-protein kinase receptor UFO(Homo sapiens (Human))
Johnson & Johnson Pharmaceutical
LigandPNGBDBM27895(8-(2,3-dihydro-1H-inden-5-yl)-N-methoxy-2-({4-[2-(...)
Affinity DataIC50: >500nMT: 2°C. Assay description: Axl was assayed using a fluorescence polarization (FP) competition immunoassay that measured Axl phosphorylation of polyGlu4Tyr. The reaction was ini...
In DepthDetails ArticlePubMed