BDBM28087 3-cyanoquinoline, 2::4-({3-chloro-4-[(1-methyl-1H-imidazol-2-yl)sulfanyl]phenyl}amino)-7-{3-[(2-hydroxyethyl)(methyl)amino]propoxy}-6-methoxyquinoline-3-carbonitrile
SMILES COc1cc2c(Nc3ccc(Sc4nccn4C)c(Cl)c3)c(cnc2cc1OCCCN(C)CCO)C#N
InChI Key InChIKey=QEMHSTOIAUCOQF-UHFFFAOYSA-N
Data  1 IC50
PDB links: 1 PDB ID matches this monomer.
  Tab Delimited (TSV)   2D SDfile   Computed 3D by Vconf -m prep SDfile
Find this compound or compounds like it in BindingDB:
Activity Spreadsheet -- Enzyme Inhibition Constant Data from BindingDB
Found 1 hit for monomerid = 28087
TargetInsulin-like growth factor 1 receptor(Homo sapiens (Human))
Wyeth Research
LigandPNGBDBM28087(3-cyanoquinoline, 2 | 4-({3-chloro-4-[(1-methyl-1H...)
Affinity DataIC50:  140nMpH: 7.5 T: 2°C. Assay description: Assays were performed in microtiter plates in reaction buffer containing biotinylated substrate, ATP, and purified kinase in the presence of test com...