BDBM281027 (7S,10S,13S)-13-((1H-Indol-3-yl)methyl)-10-(4-aminobutyl)-7-(3-aminopropyl)-3-bromo-12-methyl-6,7,9,10,12,13,15,16-octahydrobenzo[b]pyrido[3,2-p][1,5,8,11,14]thiatetraazacycloheptadecine-8,11,14(5H)-trione::US10030047, Example 236
SMILES CN1[C@@H](Cc2c[nH]c3ccccc23)C(=O)NCc2ccccc2Sc2ncc(Br)cc2CN[C@@H](CCCN)C(=O)N[C@@H](CCCCN)C1=O
InChI Key
Data  1 IC50
  Tab Delimited (TSV)   2D SDfile   Computed 3D by Vconf -m prep SDfile
Find this compound or compounds like it in BindingDB:
Activity Spreadsheet -- Enzyme Inhibition Constant Data from BindingDB
Found 1 hit for monomerid = 281027
TargetAdhesin Ata autotransporter(Acinetobacter baumannii (strain ATCC 17978 / CIP 5...)
Hoffmann-La Roche
US Patent
LigandPNGBDBM281027((7S,10S,13S)-13-((1H-Indol-3-yl)methyl)-10-(4-amin...)
Affinity DataIC50:  3.20E+3nM. Assay description: The in vitro antimicrobial activity of the compounds was alternatively determined according to the following procedure:The assay used a 10-points Iso...
Ligand InfoPC cidPC sid
In DepthDetails US Patent