BDBM281329 N-butyl-N-[2-({[6-(2-ethyl-5-fluoro-4-hydroxyphenyl)-1H-pyrazolo[4,3-c]pyridin-4-yl]amino}methyl)phe-nyl]methanesulfonamide::US10022376, Example 139
SMILES CCCCN(c1ccccc1CNc1nc(cc2[nH]ncc12)-c1cc(F)c(O)cc1CC)S(C)(=O)=O
InChI Key InChIKey=FLQXDWBNLQNAKN-UHFFFAOYSA-N
Data  4 IC50
  Tab Delimited (TSV)   2D SDfile   Computed 3D by Vconf -m prep SDfile
Find this compound or compounds like it in BindingDB:
Activity Spreadsheet -- Enzyme Inhibition Constant Data from BindingDB
Found 4 hits for monomerid = 281329
TargetTyrosine-protein kinase JAK1(Homo sapiens (Human))
Pfizer
US Patent
LigandPNGBDBM281329(N-butyl-N-[2-({[6-(2-ethyl-5-fluoro-4-hydroxypheny...)
Affinity DataIC50:  8.5nMpH: 7.4 T: 2°C. Assay description: Test article was solubilized in dimethyl sulfoxide (DMSO) to a stock concentration of 30 mM. An 11-point half log dilution series was created in DMSO...
Ligand InfoPC cidPC sid
In DepthDetails US Patent
TargetNon-receptor tyrosine-protein kinase TYK2(Homo sapiens (Human))
Pfizer
US Patent
LigandPNGBDBM281329(N-butyl-N-[2-({[6-(2-ethyl-5-fluoro-4-hydroxypheny...)
Affinity DataIC50:  1.99E+3nMpH: 7.4 T: 2°C. Assay description: Test article was solubilized in dimethyl sulfoxide (DMSO) to a stock concentration of 30 mM. An 11-point half log dilution series was created in DMSO...
Ligand InfoPC cidPC sid
In DepthDetails US Patent
TargetTyrosine-protein kinase JAK3(Homo sapiens (Human))
Pfizer
US Patent
LigandPNGBDBM281329(N-butyl-N-[2-({[6-(2-ethyl-5-fluoro-4-hydroxypheny...)
Affinity DataIC50:  27.5nMpH: 7.4 T: 2°C. Assay description: Test article was solubilized in dimethyl sulfoxide (DMSO) to a stock concentration of 30 mM. An 11-point half log dilution series was created in DMSO...
Ligand InfoPC cidPC sid
In DepthDetails US Patent
TargetTyrosine-protein kinase JAK2(Homo sapiens (Human))
Pfizer
US Patent
LigandPNGBDBM281329(N-butyl-N-[2-({[6-(2-ethyl-5-fluoro-4-hydroxypheny...)
Affinity DataIC50:  16.7nMpH: 7.4 T: 2°C. Assay description: Test article was solubilized in dimethyl sulfoxide (DMSO) to a stock concentration of 30 mM. An 11-point half log dilution series was created in DMSO...
Ligand InfoPC cidPC sid
In DepthDetails US Patent