BDBM28205 5-(5,6-dimethoxy-1H-1,3-benzodiazol-1-yl)-N,N-dimethyl-3-{[2-(trifluoromethyl)phenyl]methoxy}thiophene-2-carboxamide::benzimidazole thiophene analogue, 58
SMILES COc1cc2ncn(-c3cc(OCc4ccccc4C(F)(F)F)c(s3)C(=O)N(C)C)c2cc1OC
InChI Key InChIKey=CKYDKNBLVBVPCS-UHFFFAOYSA-N
Data  1 IC50
  Tab Delimited (TSV)   2D SDfile   Computed 3D by Vconf -m prep SDfile
Find this compound or compounds like it in BindingDB:
Activity Spreadsheet -- Enzyme Inhibition Constant Data from BindingDB
Found 1 hit for monomerid = 28205
TargetSerine/threonine-protein kinase PLK1(Homo sapiens (Human))
Gsk
LigandPNGBDBM28205(5-(5,6-dimethoxy-1H-1,3-benzodiazol-1-yl)-N,N-dime...)
Affinity DataIC50: >1.00E+3nM. Assay description: The compound inhibitory activity was determined by incubation with purified PLK enzyme and biotinylated peptide substrate in the presence ATP/[gamma-...
In DepthDetails ArticlePubMed