BDBM282820 6-(4-(4-fluorophenyl)-1-(3- (hydroxymethyl)cyclobutyl)-1H-imidazol-5- yl)imidazo[1,2-b]pyridazine-3-carbonitrile::US10287295, Example 27'::US11352360, Example 27'::US9884868, Example 27'
SMILES OCC1CC(C1)n1cnc(c1-c1ccc2ncc(C#N)n2n1)-c1ccc(F)cc1
InChI Key InChIKey=IWZYADDJULNIJB-UHFFFAOYSA-N
Data  6 IC50
  Tab Delimited (TSV)   2D SDfile   Computed 3D by Vconf -m prep SDfile
Find this compound or compounds like it in BindingDB:
Activity Spreadsheet -- Enzyme Inhibition Constant Data from BindingDB
Found 6 hits for monomerid = 282820
TargetTGF-beta receptor type-1(Homo sapiens (Human))
Rigel Pharmaceuticals
US Patent
LigandPNGBDBM282820(6-(4-(4-fluorophenyl)-1-(3- (hydroxymethyl)cyclobu...)
Affinity DataIC50:  0.600nMpH: 7.4 T: 2°C. Assay description: Assays for the compounds reported below were conducted in 1536-well plates and 2 mL reactions are prepared from addition of HIS-TGF-βR1 T204D or...
Ligand InfoPC cidPC sid
In DepthDetails US Patent
TargetTGF-beta receptor type-2(Homo sapiens (Human))
Rigel Pharmaceuticals
US Patent
LigandPNGBDBM282820(6-(4-(4-fluorophenyl)-1-(3- (hydroxymethyl)cyclobu...)
Affinity DataIC50:  2.25E+3nM
Ligand InfoPC cidPC sid
In DepthDetails US Patent
TargetTGF-beta receptor type-2(Homo sapiens (Human))
Rigel Pharmaceuticals
US Patent
LigandPNGBDBM282820(6-(4-(4-fluorophenyl)-1-(3- (hydroxymethyl)cyclobu...)
Affinity DataIC50:  2.25E+3nM
Ligand InfoPC cidPC sid
In DepthDetails US Patent
TargetTGF-beta receptor type-2(Homo sapiens (Human))
Rigel Pharmaceuticals
US Patent
LigandPNGBDBM282820(6-(4-(4-fluorophenyl)-1-(3- (hydroxymethyl)cyclobu...)
Affinity DataIC50:  2.25E+3nM. Assay description: Assays for the compounds reported below were conducted in 1536-well plates and 2 mL reactions are prepared from addition of HIS-TGF-βR1 T204D or...
Ligand InfoPC cidPC sid
In DepthDetails US Patent
TargetTGF-beta receptor type-1(Homo sapiens (Human))
Rigel Pharmaceuticals
US Patent
LigandPNGBDBM282820(6-(4-(4-fluorophenyl)-1-(3- (hydroxymethyl)cyclobu...)
Affinity DataIC50:  0.600nM. Assay description: Assays for the compounds reported below were conducted in 1536-well plates and 2 mL reactions are prepared from addition of HIS-TGF-βR1 T204D or...
Ligand InfoPC cidPC sid
In DepthDetails US Patent
TargetTGF-beta receptor type-1 [T204D](Homo sapiens (Human))
Rigel Pharmaceuticals
US Patent
LigandPNGBDBM282820(6-(4-(4-fluorophenyl)-1-(3- (hydroxymethyl)cyclobu...)
Affinity DataIC50:  0.600nM. Assay description: Assays for the compounds reported below were conducted in 1536-well plates and 2 mL reactions are prepared from addition of HIS-TGF-βR1 T204D or...
Ligand InfoPC cidPC sid
In DepthDetails US Patent