BDBM283450 N-((6-amino-2,4-dimethylpyridin-3-yl)methyl)- 2-((3-chloro-5-fluoroquinolin-6- yl)methyl)isonicotinamide::US10023557, Example 102::US10266515, Example 102::US10308637, Example 102::US11021463, Example 102::US9611252, Example 102
SMILES Cc1cc(N)nc(C)c1CNC(=O)c1ccnc(Cc2ccc3ncc(Cl)cc3c2F)c1
InChI Key InChIKey=MDLFAZWEMPYOEY-UHFFFAOYSA-N
Data  5 IC50  1 EC50
  Tab Delimited (TSV)   2D SDfile   Computed 3D by Vconf -m prep SDfile
Find this compound or compounds like it in BindingDB:
Activity Spreadsheet -- Enzyme Inhibition Constant Data from BindingDB
Found 6 hits for monomerid = 283450
TargetPlasma kallikrein(Homo sapiens (Human))
Lifesci Pharmaceuticals
US Patent
LigandPNGBDBM283450(N-((6-amino-2,4-dimethylpyridin-3-yl)methyl)- 2-((...)
Affinity DataIC50: <100nMpH: 7.5Assay Description:A 10 mM solution of the test compound was made in DMSO. This solution was serially diluted 1:5 in DMSO to yield 2000, 400, 80, 16, 3.2, 0.64, 0.128, ...
Ligand InfoPC cidPC sid
In DepthDetails US Patent
TargetPlasma kallikrein(Homo sapiens (Human))
Lifesci Pharmaceuticals
US Patent
LigandPNGBDBM283450(N-((6-amino-2,4-dimethylpyridin-3-yl)methyl)- 2-((...)
Affinity DataEC50:  550nM. Assay description: The test compounds at various concentrations, also prepared by serial dilutions as described above, are added to the test wells. The volume of test c...
Ligand InfoPC cidPC sid
In DepthDetails US Patent
TargetPlasma kallikrein(Homo sapiens (Human))
Lifesci Pharmaceuticals
US Patent
LigandPNGBDBM283450(N-((6-amino-2,4-dimethylpyridin-3-yl)methyl)- 2-((...)
Affinity DataIC50: <100nM. Assay description: A 10 mM solution of the test compound was made in DMSO. This solution was serially diluted 1:5 in DMSO to yield 2000, 400, 80, 16, 3.2, 0.64, 0.128, ...
Ligand InfoPC cidPC sid
In DepthDetails US Patent
TargetMitogen-activated protein kinase kinase kinase kinase 1(Homo sapiens (Human))
Lifesci Pharmaceuticals
US Patent
LigandPNGBDBM283450(N-((6-amino-2,4-dimethylpyridin-3-yl)methyl)- 2-((...)
Affinity DataIC50: <100nM. Assay description: A 10 mM solution of the test compound was made in DMSO. This solution was serially diluted 1:5 in DMSO to yield 2000, 400, 80, 16, 3.2, 0.64, 0.128, ...
Ligand InfoPC cidPC sid
In DepthDetails US Patent
TargetPlasma kallikrein(Homo sapiens (Human))
Lifesci Pharmaceuticals
US Patent
LigandPNGBDBM283450(N-((6-amino-2,4-dimethylpyridin-3-yl)methyl)- 2-((...)
Affinity DataIC50: <100nM. Assay description: A 10 mM solution of the test compound was made in DMSO. This solution was serially diluted 1:5 in DMSO to yield 2000, 400, 80, 16, 3.2, 0.64, 0.128, ...
Ligand InfoPC cidPC sid
In DepthDetails US Patent
TargetPlasma kallikrein(Homo sapiens (Human))
Lifesci Pharmaceuticals
US Patent
LigandPNGBDBM283450(N-((6-amino-2,4-dimethylpyridin-3-yl)methyl)- 2-((...)
Affinity DataIC50: <100nM. Assay description: The ability of the compounds disclosed herein to inhibit human plasma kallikrein activity was quantified according to the procedures below.A 10 mM so...
Ligand InfoPC cidPC sid
In DepthDetails US Patent