BDBM28346 1-[(9S)-6-chloro-2-thiatricyclo[9.4.0.0^{3,8}]pentadeca-1(15),3(8),4,6,11,13-hexaen-9-yl]-4-ethylpiperazine-1,4-diium::ZINC00702046, 5
SMILES CC[NH+]1CC[NH+](CC1)[C@H]1Cc2ccccc2Sc2ccc(Cl)cc12
InChI Key InChIKey=XHQHCGIOFLGRDM-SFHVURJKSA-P
Data  2 IC50
  Tab Delimited (TSV)   2D SDfile   Computed 3D by Vconf -m prep SDfile
Find this compound or compounds like it in BindingDB:
Activity Spreadsheet -- Enzyme Inhibition Constant Data from BindingDB
Found 2 hits for monomerid = 28346
TargetTrypanothione reductase(Trypanosoma brucei brucei)
University Of Alberta
LigandPNGBDBM28346(1-[(9S)-6-chloro-2-thiatricyclo[9.4.0.0^{3,8}]pent...)
Affinity DataIC50:  3.60E+4nMpH: 7.5 T: 2°C. Assay description: Inhibition of TryR was carried out in 96-well plates using a Biotek Precision 2000 automated liquid handler. Reaction was initiated by addition of NA...
In DepthDetails ArticlePubMed
TargetTrypanothione reductase(Trypanosoma cruzi)
University Of Alberta
LigandPNGBDBM28346(1-[(9S)-6-chloro-2-thiatricyclo[9.4.0.0^{3,8}]pent...)
Affinity DataIC50:  2.91E+4nMpH: 7.5 T: 2°C. Assay description: Inhibition of TryR was carried out in 96-well plates using a Biotek Precision 2000 automated liquid handler. Reaction was initiated by addition of NA...
In DepthDetails ArticlePubMed