BDBM284292 US10023570, Example 302::US10174027, Example 302
SMILES Cn1cc(cn1)-c1cc(-c2ccc(cc2)C2CCN(CC2)C(=O)CC(C)(C)C)c2c(cnn2c1)C#N
InChI Key InChIKey=YMWIVJYQFILSLI-UHFFFAOYSA-N
Data  3 IC50
  Tab Delimited (TSV)   2D SDfile   Computed 3D by Vconf -m prep SDfile
Find this compound or compounds like it in BindingDB:
Activity Spreadsheet -- Enzyme Inhibition Constant Data from BindingDB
Found 3 hits for monomerid = 284292
TargetProto-oncogene tyrosine-protein kinase receptor Ret [658-1114](Homo sapiens (Human))
Array Biopharma
US Patent
LigandPNGBDBM284292(US10023570, Example 302 | US10174027, Example 302)
Affinity DataIC50:  49.6nMpH: 7.4Assay Description:Compounds of General Formula I were screened for their ability to inhibit wild type and V804M mutant RET kinase using CisBio's HTRF® KinEASE -TK ...
Ligand InfoPC cidPC sid
In DepthDetails US Patent
TargetProto-oncogene tyrosine-protein kinase receptor Ret(Homo sapiens (Human))
Array Biopharma
US Patent
LigandPNGBDBM284292(US10023570, Example 302 | US10174027, Example 302)
Affinity DataIC50:  49.6nM. Assay description: Compounds of General Formula I were screened for their ability to inhibit wild type and V804M mutant RET kinase using CisBio's HTRF® KinEASE¿-TK ...
Ligand InfoPC cidPC sid
In DepthDetails US Patent
TargetProto-oncogene tyrosine-protein kinase receptor Ret(Homo sapiens (Human))
Array Biopharma
US Patent
LigandPNGBDBM284292(US10023570, Example 302 | US10174027, Example 302)
Affinity DataIC50:  49.6nM. Assay description: Compounds of General Formula I were screened for their ability to inhibit wild type and V804M mutant RET kinase using CisBio's HTRF® KinEASE-TK a...
Ligand InfoPC cidPC sid
In DepthDetails US Patent