BDBM28573 1-sulfonylindazole, 6b::3-amino-N-[1-(naphthalene-1-sulfonyl)-1H-indazol-5-yl]propanamide
SMILES NCCC(=O)Nc1ccc2n(ncc2c1)S(=O)(=O)c1cccc2ccccc12
InChI Key InChIKey=GHBONLWSLKVFES-UHFFFAOYSA-N
Data  1 KI
  Tab Delimited (TSV)   2D SDfile   Computed 3D by Vconf -m prep SDfile
Find this compound or compounds like it in BindingDB:
Activity Spreadsheet -- Enzyme Inhibition Constant Data from BindingDB
Found 1 hit for monomerid = 28573
Target5-hydroxytryptamine receptor 6(Homo sapiens (Human))
Wyeth Research
LigandPNGBDBM28573(1-sulfonylindazole, 6b | 3-amino-N-[1-(naphthalene...)
Affinity DataKi:  50nM ΔG°:  -9.85kcal/molepH: 7.4 T: 2°C. Assay description: Competition experiments were performed in the presence radioligand with membrane protein (obtained from cells expressing the receptor) and test compo...
In DepthDetails ArticlePubMed