BDBM29040 cambinol
SMILES Oc1ccc2ccccc2c1Cc1c([nH]c(=S)[nH]c1=O)-c1ccccc1
InChI Key InChIKey=RVNSQVIUFZVNAU-UHFFFAOYSA-N
Data  35 IC50
  Tab Delimited (TSV)   2D SDfile   Computed 3D by Vconf -m prep SDfile
Find this compound or compounds like it in BindingDB:
Activity Spreadsheet -- Enzyme Inhibition Constant Data from BindingDB
Found 35 hits for monomerid = 29040
TargetNAD-dependent protein deacetylase sirtuin-1(Homo sapiens (Human))
University Of St. Andrews
LigandPNGBDBM29040(cambinol)
Affinity DataIC50:  4.07E+4nMpH: 8.0 T: 2°C. Assay description: Compounds were tested for inhibition of sirtuin (SIRT1 or SIRT2) using the human recombinant enzyme provided with the Fluor de Lys fluorescence-based...
In DepthDetails ArticlePubMed
TargetNAD-dependent protein deacetylase sirtuin-2(Homo sapiens (Human))
Chinese Academy Of Sciences
Curated by ChEMBL
LigandPNGBDBM29040(cambinol)
Affinity DataIC50:  5.90E+4nM. Assay description: Inhibition of GST-tagged human SIRT2 using acetyl-histone-H4 peptide as substrate in presence of NAD+
In DepthDetails ArticlePubMed
TargetNAD-dependent protein deacetylase sirtuin-1(Homo sapiens (Human))
University Of St. Andrews
LigandPNGBDBM29040(cambinol)
Affinity DataIC50:  5.60E+4nM. Assay description: Inhibition of C-terminal His-6-tagged recombinant human SIRT1 expressed in Escherichia coli BL21(DE3) by luminescence assay
In DepthDetails ArticlePubMed
TargetNAD-dependent protein deacetylase sirtuin-2(Homo sapiens (Human))
Chinese Academy Of Sciences
Curated by ChEMBL
LigandPNGBDBM29040(cambinol)
Affinity DataIC50:  5.10E+4nM. Assay description: Inhibition of SIRT2 (unknown origin) by luminescence assay
In DepthDetails ArticlePubMed
TargetNAD-dependent protein deacetylase sirtuin-3, mitochondrial(Homo sapiens (Human))
Fred Hutchinson Cancer Research Center
Curated by ChEMBL
LigandPNGBDBM29040(cambinol)
Affinity DataIC50: >2.00E+5nM. Assay description: Inhibition of SIRT3 (unknown origin) by luminescence assay
In DepthDetails ArticlePubMed
TargetNAD-dependent protein deacetylase sirtuin-1(Homo sapiens (Human))
University Of St. Andrews
LigandPNGBDBM29040(cambinol)
Affinity DataIC50:  4.79E+4nM. Assay description: Inhibition of human recombinant N-terminal GST-tagged SIRT1 (193 to 741 amino acid) after 45 mins by spectrophotometry relative to control
In DepthDetails ArticlePubMed
TargetNAD-dependent protein deacetylase sirtuin-2(Homo sapiens (Human))
Chinese Academy Of Sciences
Curated by ChEMBL
LigandPNGBDBM29040(cambinol)
Affinity DataIC50:  4.59E+4nM. Assay description: Inhibition of human recombinant C-terminal His-tagged SIRT2 (13 to 319 amino acid) after 45 mins by spectrophotometry relative to control
In DepthDetails ArticlePubMed
TargetNAD-dependent protein deacetylase sirtuin-1(Homo sapiens (Human))
University Of St. Andrews
LigandPNGBDBM29040(cambinol)
Affinity DataIC50:  5.79E+4nM. Assay description: Inhibition of human recombinant SIRT1 expressed in Escherichia coli incubated at 37 degC for 2 hrs by Fluor de Lys fluorescence assay
In DepthDetails ArticlePubMed
TargetNAD-dependent protein deacetylase sirtuin-2(Homo sapiens (Human))
Chinese Academy Of Sciences
Curated by ChEMBL
LigandPNGBDBM29040(cambinol)
Affinity DataIC50:  4.07E+4nM. Assay description: Inhibition of human recombinant SIRT2 expressed in Escherichia coli incubated at 37 degC for 2 hrs by Fluor de Lys fluorescence assay
In DepthDetails ArticlePubMed
TargetNAD-dependent protein deacetylase sirtuin-2(Homo sapiens (Human))
Chinese Academy Of Sciences
Curated by ChEMBL
LigandPNGBDBM29040(cambinol)
Affinity DataIC50:  4.21E+4nM. Assay description: Inhibition of human recombinant SIRT2 expressed in Escherichia coli cells using acetylated Lys side chain amino acids 379-382 (Arg-His-Lys-Lys(Ac)) p...
In DepthDetails ArticlePubMed
TargetNAD-dependent protein deacetylase sirtuin-2(Homo sapiens (Human))
Chinese Academy Of Sciences
Curated by ChEMBL
LigandPNGBDBM29040(cambinol)
Affinity DataIC50:  5.90E+4nM. Assay description: Inhibition of SIRT2
In DepthDetails ArticlePubMed
TargetNAD-dependent protein deacetylase sirtuin-1(Homo sapiens (Human))
University Of St. Andrews
LigandPNGBDBM29040(cambinol)
Affinity DataIC50:  5.60E+4nM. Assay description: Inhibition of SIRT1
In DepthDetails ArticlePubMed
TargetNAD-dependent protein deacetylase sirtuin-2(Homo sapiens (Human))
Chinese Academy Of Sciences
Curated by ChEMBL
LigandPNGBDBM29040(cambinol)
Affinity DataIC50:  5.90E+4nM. Assay description: Inhibition of human GST-tagged SIRT2 expressed in bacterial expression system assessed as deacetylation activity using [3H]acetyl-H4 peptide as subst...
In DepthDetails ArticlePubMed
TargetNAD-dependent protein deacetylase sirtuin-1(Homo sapiens (Human))
University Of St. Andrews
LigandPNGBDBM29040(cambinol)
Affinity DataIC50:  5.60E+4nM. Assay description: Inhibition of human SIRT1 expressed in bacterial expression system assessed as reduction in conversion of [3H]acetyl-H4 to [3H]acetic acid measured a...
In DepthDetails ArticlePubMed
TargetNAD-dependent protein deacetylase sirtuin-2(Homo sapiens (Human))
Chinese Academy Of Sciences
Curated by ChEMBL
LigandPNGBDBM29040(cambinol)
Affinity DataIC50:  5.29E+4nM. Assay description: Inhibition of human recombinant C-terminal His-tagged SIRT2 (13 to 319) after 45 mins by fluorescence assay
In DepthDetails ArticlePubMed
TargetNAD-dependent protein deacetylase sirtuin-1(Homo sapiens (Human))
University Of St. Andrews
LigandPNGBDBM29040(cambinol)
Affinity DataIC50:  4.79E+4nM. Assay description: Inhibition of human recombinant N-terminal GST-tagged SIRT1 (193 to 741) after 45 mins by fluorescence assay
In DepthDetails ArticlePubMed
TargetNAD-dependent protein deacetylase sirtuin-3, mitochondrial(Homo sapiens (Human))
Fred Hutchinson Cancer Research Center
Curated by ChEMBL
LigandPNGBDBM29040(cambinol)
Affinity DataIC50:  1.29E+4nM. Assay description: Inhibition of recombinant human His6-tagged SIRT3 using H2N-HK-[Nepsilon-acetyl-lysine]-LM-COOH as substrate incubated for 10 mins in presence of bet...
In DepthDetails ArticlePubMed
TargetNAD-dependent protein deacetylase sirtuin-1(Homo sapiens (Human))
University Of St. Andrews
LigandPNGBDBM29040(cambinol)
Affinity DataIC50:  8.85E+3nM. Assay description: Inhibition of recombinant human GST or His6-tagged SIRT1 using H2N-HK-[Nepsilon-acetyl-lysine]-LM-COOH as substrate incubated for 10 mins in presence...
In DepthDetails ArticlePubMed
TargetNAD-dependent protein deacetylase sirtuin-2(Homo sapiens (Human))
Chinese Academy Of Sciences
Curated by ChEMBL
LigandPNGBDBM29040(cambinol)
Affinity DataIC50:  1.09E+4nM. Assay description: Inhibition of recombinant human His6-tagged SIRT2 using H2N-HK-[Nepsilon-acetyl-lysine]-LM-COOH as substrate incubated for 12 mins in presence of bet...
In DepthDetails ArticlePubMed
TargetNAD-dependent protein deacetylase sirtuin-3, mitochondrial(Homo sapiens (Human))
Fred Hutchinson Cancer Research Center
Curated by ChEMBL
LigandPNGBDBM29040(cambinol)
Affinity DataIC50: >3.00E+5nM. Assay description: Inhibition of human GST-tagged SIRT3 assessed as inhibition of deacetylation of [3H]acetyl-H4 peptide after 3 hrs by liquid scintillation counting an...
In DepthDetails ArticlePubMed
TargetNAD-dependent protein deacetylase sirtuin-2(Homo sapiens (Human))
Chinese Academy Of Sciences
Curated by ChEMBL
LigandPNGBDBM29040(cambinol)
Affinity DataIC50:  5.90E+4nM. Assay description: Inhibition of human GST-tagged SIRT2 assessed as inhibition of deacetylation of [3H]acetyl-H4 peptide after 3 hrs by liquid scintillation counting an...
In DepthDetails ArticlePubMed
TargetNAD-dependent protein deacetylase sirtuin-1(Homo sapiens (Human))
University Of St. Andrews
LigandPNGBDBM29040(cambinol)
Affinity DataIC50:  5.60E+4nM. Assay description: Inhibition of human GST-tagged SIRT1 assessed as inhibition of deacetylation of [3H]acetyl-H4 peptide after 3 hrs by liquid scintillation counting an...
In DepthDetails ArticlePubMed
TargetNAD-dependent protein deacetylase HST2(Saccharomyces cerevisiae)
Institute
Curated by ChEMBL
LigandPNGBDBM29040(cambinol)
Affinity DataIC50: >1.00E+6nM. Assay description: Inhibition of yeast Hst2 by fluorimetric assay
In DepthDetails ArticlePubMed
TargetNAD-dependent protein deacetylase sirtuin-1(Homo sapiens (Human))
University Of St. Andrews
LigandPNGBDBM29040(cambinol)
Affinity DataIC50: >6.00E+5nM. Assay description: Inhibition of human full length SIRT1 expressed in DE3 cells by fluorimetric assay
In DepthDetails ArticlePubMed
TargetNAD-dependent protein deacylase sirtuin-5, mitochondrial(Homo sapiens (Human))
TBA
Curated by ChEMBL
LigandPNGBDBM29040(cambinol)
Affinity DataIC50:  4.25E+4nM. Assay description: Inhibition of SIRT5 using ZK(suc)A substrate after 1 hr by homogeneous fluorescence assay
In DepthDetails ArticlePubMed
TargetNAD-dependent protein deacetylase sirtuin-2(Homo sapiens (Human))
Chinese Academy Of Sciences
Curated by ChEMBL
LigandPNGBDBM29040(cambinol)
Affinity DataIC50:  5.90E+4nM. Assay description: Inhibition of recombinant SIRT2 using ZMAL substrate after 4 hrs by homogeneous fluorescence assay
In DepthDetails ArticlePubMed
TargetNAD-dependent protein deacetylase sirtuin-1(Homo sapiens (Human))
University Of St. Andrews
LigandPNGBDBM29040(cambinol)
Affinity DataIC50:  5.60E+4nM. Assay description: Inhibition of recombinant SIRT1 using ZMAL substrate after 4 hrs by homogeneous fluorescence assay
In DepthDetails ArticlePubMed
TargetSphingomyelin phosphodiesterase 3(Homo sapiens)
Johns Hopkins University
Curated by ChEMBL
LigandPNGBDBM29040(cambinol)
Affinity DataIC50:  5.00E+3nM. Assay description: Inhibition of human recombinant nSMase expressed in HEK293 cells using sphingomyelin as substrate by alkaline phosphatase, choline oxidase and horser...
In DepthDetails ArticlePubMed
TargetNAD-dependent protein deacetylase sirtuin-2(Homo sapiens (Human))
Chinese Academy Of Sciences
Curated by ChEMBL
LigandPNGBDBM29040(cambinol)
Affinity DataIC50:  3.88E+4nM. Assay description: Inhibition of SIRT2 (unknown origin) using fluorogenic substrate assessed as deacetylase activity incubated for 45 mins by fluorescence assay
In DepthDetails ArticlePubMed
TargetNAD-dependent protein deacetylase sirtuin-2(Homo sapiens (Human))
Chinese Academy Of Sciences
Curated by ChEMBL
LigandPNGBDBM29040(cambinol)
Affinity DataIC50:  4.99E+4nM. Assay description: Inhibition of SIRT2 (unknown origin) assessed as increase in alpha-tubulin acetylation after 2 hrs by alpha-tubulin acetyl-K40 assay
In DepthDetails ArticlePubMed
TargetNAD-dependent protein deacetylase sirtuin-2(Homo sapiens (Human))
Chinese Academy Of Sciences
Curated by ChEMBL
LigandPNGBDBM29040(cambinol)
Affinity DataIC50:  4.99E+4nM. Assay description: Inhibition of SIRT2 (unknown origin) assessed as increase in alpha-tubulin acetylation after 2 hrs by alpha-tubulin acetyl-K40 assay
In DepthDetails ArticlePubMed
TargetNAD-dependent protein deacetylase sirtuin-2(Homo sapiens (Human))
Chinese Academy Of Sciences
Curated by ChEMBL
LigandPNGBDBM29040(cambinol)
Affinity DataIC50:  3.88E+4nM. Assay description: Inhibition of SIRT2 (unknown origin) using fluorogenic substrate assessed as deacetylase activity incubated for 45 mins by fluorescence assay
In DepthDetails ArticlePubMed
TargetSphingomyelin phosphodiesterase 3(Homo sapiens)
Johns Hopkins University
Curated by ChEMBL
LigandPNGBDBM29040(cambinol)
Affinity DataIC50: >1.00E+3nM. Assay description: Inhibition of human recombinant full-length nSMase expressed in HEK293 cells using sphingomyelin as substrate measured after 1 hr by alkaline phospha...
In DepthDetails ArticlePubMed
TargetNAD-dependent protein deacetylase sirtuin-1(Homo sapiens (Human))
University Of St. Andrews
LigandPNGBDBM29040(cambinol)
Affinity DataIC50:  5.60E+4nM. Assay description: Inhibition of human SIRT1 using acetyl-histone-H4 peptide as substrate in presence of NAD+
In DepthDetails ArticlePubMed
TargetNAD-dependent protein deacetylase sirtuin-2(Homo sapiens (Human))
Chinese Academy Of Sciences
Curated by ChEMBL
LigandPNGBDBM29040(cambinol)
Affinity DataIC50:  4.79E+4nM. Assay description: Compounds were tested for inhibition of sirtuin (SIRT1 or SIRT2) using the human recombinant enzyme provided with the Fluor de Lys fluorescence-based...
In DepthDetails ArticlePubMed