BDBM291905 N-(benzofuran-4-ylmethyl)-8-(4-((1-methylpiperidin-4-yl)sulfonyl)phenyl)-[1,2,4]triazolo[4,3-c]pyrimidin-5-amine::US11207325, Example 220::US9580437, Example 220
SMILES CN1CCC(CC1)S(=O)(=O)c1ccc(cc1)-c1cnc(NCc2cccc3occc23)n2cnnc12
InChI Key InChIKey=VZTRXNJTMMFEKF-UHFFFAOYSA-N
Data  6 IC50
  Tab Delimited (TSV)   2D SDfile   Computed 3D by Vconf -m prep SDfile
Find this compound or compounds like it in BindingDB:
Activity Spreadsheet -- Enzyme Inhibition Constant Data from BindingDB
Found 6 hits for monomerid = 291905
LigandPNGBDBM291905(N-(benzofuran-4-ylmethyl)-8-(4-((1-methylpiperidin...)
Affinity DataIC50:  14.1nMpH: 8.0Assay Description:To assess the compounds potency in the EED-H3K27Me3 competition binding assay, compounds were serially diluted 3-fold in DMSO to obtain a total of tw...
Ligand InfoPC cidPC sid
In DepthDetails US Patent
LigandPNGBDBM291905(N-(benzofuran-4-ylmethyl)-8-(4-((1-methylpiperidin...)
Affinity DataIC50:  21.6nMpH: 8.0Assay Description:Representative compounds of the present disclosure were serially and separately diluted 3-fold in DMSO to obtain a total of eight or twelve concentra...
Ligand InfoPC cidPC sid
In DepthDetails US Patent
TargetPolycomb protein EED(Homo sapiens (Human))
Novartis
US Patent
LigandPNGBDBM291905(N-(benzofuran-4-ylmethyl)-8-(4-((1-methylpiperidin...)
Affinity DataIC50:  467nM. Assay description: Representative compounds of the present disclosure were serially and separately diluted 3-fold in DMSO to obtain a total of eight or twelve concentra...
Ligand InfoPC cidPC sid
In DepthDetails US Patent
TargetPolycomb protein EED(Homo sapiens (Human))
Novartis
US Patent
LigandPNGBDBM291905(N-(benzofuran-4-ylmethyl)-8-(4-((1-methylpiperidin...)
Affinity DataIC50:  14.1nM. Assay description: To assess the compounds potency in the EED-H3K27Me3 competition binding assay, compounds were serially diluted 3-fold in DMSO to obtain a total of tw...
Ligand InfoPC cidPC sid
In DepthDetails US Patent
TargetPolycomb protein EED(Homo sapiens (Human))
Novartis
US Patent
LigandPNGBDBM291905(N-(benzofuran-4-ylmethyl)-8-(4-((1-methylpiperidin...)
Affinity DataIC50:  21.6nM. Assay description: Representative compounds of the present disclosure were serially and separately diluted 3-fold in DMSO to obtain a total of eight or twelve concentra...
Ligand InfoPC cidPC sid
In DepthDetails US Patent
LigandPNGBDBM291905(N-(benzofuran-4-ylmethyl)-8-(4-((1-methylpiperidin...)
Affinity DataIC50:  467nM. Assay description: Cell lysates were transferred to the wells of a 384-well plate and the final volume was adjusted to 50 μL per well with PBS. The plate was seale...
Ligand InfoPC cidPC sid
In DepthDetails US Patent