BDBM292117 US10100049, Example 14::US10183942, Example 14-7::US10526330, Example 14::US10913740, Example 14-7::US11299492, Example 14::US11718616, Example 14
SMILES CCc1cc(O)c(F)cc1-c1ccc2c(n[nH]c2c1)-c1nc2CN(C[C@@H]3COCCN3)CCc2[nH]1
InChI Key InChIKey=FVHMQGDVYVQATO-OZMIJRPQSA-N
Data  36 KI
  Tab Delimited (TSV)   2D SDfile   Computed 3D by Vconf -m prep SDfile
Find this compound or compounds like it in BindingDB:
Activity Spreadsheet -- Enzyme Inhibition Constant Data from BindingDB
Found 36 hits for monomerid = 292117
TargetTyrosine-protein kinase JAK1(Homo sapiens (Human))
Theravance Biopharma R&D Ip
US Patent
LigandPNGBDBM292117(US10100049, Example 14 | US10183942, Example 14-7 ...)
Affinity DataKi: <0.100nMpH: 7.5Assay Description:A panel of four LanthaScreen JAK biochemical assays (JAKL 2, 3 and Tyk2) were carried in a common kinase reaction buffer (50 mM HEPES, pH 7.5, 0.01% ...
Ligand InfoPC cidPC sid
In DepthDetails US Patent
TargetTyrosine-protein kinase JAK2(Homo sapiens (Human))
Theravance Biopharma R&D Ip
US Patent
LigandPNGBDBM292117(US10100049, Example 14 | US10183942, Example 14-7 ...)
Affinity DataKi: <0.100nMpH: 7.5Assay Description:A panel of four LanthaScreen JAK biochemical assays (JAKL 2, 3 and Tyk2) were carried in a common kinase reaction buffer (50 mM HEPES, pH 7.5, 0.01% ...
Ligand InfoPC cidPC sid
In DepthDetails US Patent
TargetTyrosine-protein kinase JAK2(Homo sapiens (Human))
Theravance Biopharma R&D Ip
US Patent
LigandPNGBDBM292117(US10100049, Example 14 | US10183942, Example 14-7 ...)
Affinity DataKi: <0.100nM. Assay description: A panel of four LanthaScreen JAK biochemical assays (JAK1, 2, 3 and Tyk2) were carried in a common kinase reaction buffer (50 mM HEPES, pH 7.5, 0.01%...
Ligand InfoPC cidPC sid
In DepthDetails US Patent
TargetTyrosine-protein kinase JAK1(Homo sapiens (Human))
Theravance Biopharma R&D Ip
US Patent
LigandPNGBDBM292117(US10100049, Example 14 | US10183942, Example 14-7 ...)
Affinity DataKi: <0.100nM. Assay description: A panel of four LanthaScreen JAK biochemical assays (JAK1, 2, 3 and Tyk2) were carried in a common kinase reaction buffer (50 mM HEPES, pH 7.5, 0.01%...
Ligand InfoPC cidPC sid
In DepthDetails US Patent
TargetTyrosine-protein kinase JAK2(Homo sapiens (Human))
Theravance Biopharma R&D Ip
US Patent
LigandPNGBDBM292117(US10100049, Example 14 | US10183942, Example 14-7 ...)
Affinity DataKi: <0.100nM. Assay description: All of the compounds of Examples 1 to 16 and Tables 1 to 19 were tested in one or more of the assays described above. In the following tables, for th...
Ligand InfoPC cidPC sid
In DepthDetails US Patent
TargetTyrosine-protein kinase JAK1(Homo sapiens (Human))
Theravance Biopharma R&D Ip
US Patent
LigandPNGBDBM292117(US10100049, Example 14 | US10183942, Example 14-7 ...)
Affinity DataKi: <0.100nM. Assay description: All of the compounds of Examples 1 to 16 and Tables 1 to 19 were tested in one or more of the assays described above. In the following tables, for th...
Ligand InfoPC cidPC sid
In DepthDetails US Patent
TargetTyrosine-protein kinase JAK3(Homo sapiens (Human))
Theravance Biopharma R&D Ip
US Patent
LigandPNGBDBM292117(US10100049, Example 14 | US10183942, Example 14-7 ...)
Affinity DataKi: <0.100nM. Assay description: A panel of four LanthaScreen JAK biochemical assays (JAK1, 2, 3 and Tyk2) were carried in a common kinase reaction buffer (50 mM HEPES, pH 7.5, 0.01%...
Ligand InfoPC cidPC sid
In DepthDetails US Patent
TargetTyrosine-protein kinase JAK2(Homo sapiens (Human))
Theravance Biopharma R&D Ip
US Patent
LigandPNGBDBM292117(US10100049, Example 14 | US10183942, Example 14-7 ...)
Affinity DataKi: <0.100nM. Assay description: A panel of four LanthaScreen JAK biochemical assays (JAK1, 2, 3 and Tyk2) were carried in a common kinase reaction buffer (50 mM HEPES, pH 7.5, 0.01%...
Ligand InfoPC cidPC sid
In DepthDetails US Patent
TargetTyrosine-protein kinase JAK1(Homo sapiens (Human))
Theravance Biopharma R&D Ip
US Patent
LigandPNGBDBM292117(US10100049, Example 14 | US10183942, Example 14-7 ...)
Affinity DataKi: <0.100nM. Assay description: A panel of four LanthaScreen JAK biochemical assays (JAK1, 2, 3 and Tyk2) were carried in a common kinase reaction buffer (50 mM HEPES, pH 7.5, 0.01%...
Ligand InfoPC cidPC sid
In DepthDetails US Patent
TargetTyrosine-protein kinase JAK2(Homo sapiens (Human))
Theravance Biopharma R&D Ip
US Patent
LigandPNGBDBM292117(US10100049, Example 14 | US10183942, Example 14-7 ...)
Affinity DataKi: <0.100nM. Assay description: A panel of four LanthaScreen JAK biochemical assays (JAK1, 2, 3 and Tyk2) were carried in a common kinase reaction buffer (50 mM HEPES, pH 7.5, 0.01%...
Ligand InfoPC cidPC sid
In DepthDetails US Patent
TargetTyrosine-protein kinase JAK1(Homo sapiens (Human))
Theravance Biopharma R&D Ip
US Patent
LigandPNGBDBM292117(US10100049, Example 14 | US10183942, Example 14-7 ...)
Affinity DataKi: <0.100nM. Assay description: A panel of four LanthaScreen JAK biochemical assays (JAK1, 2, 3 and Tyk2) were carried in a common kinase reaction buffer (50 mM HEPES, pH 7.5, 0.01%...
Ligand InfoPC cidPC sid
In DepthDetails US Patent
TargetTyrosine-protein kinase JAK3(Homo sapiens (Human))
Theravance Biopharma R&D Ip
US Patent
LigandPNGBDBM292117(US10100049, Example 14 | US10183942, Example 14-7 ...)
Affinity DataKi: <0.100nM. Assay description: A panel of four LanthaScreen JAK biochemical assays (JAK1, 2, 3 and Tyk2) were carried in a common kinase reaction buffer (50 mM HEPES, pH 7.5, 0.01%...
Ligand InfoPC cidPC sid
In DepthDetails US Patent
TargetTyrosine-protein kinase JAK2(Homo sapiens (Human))
Theravance Biopharma R&D Ip
US Patent
LigandPNGBDBM292117(US10100049, Example 14 | US10183942, Example 14-7 ...)
Affinity DataKi: <0.100nM. Assay description: A panel of four LanthaScreen JAK biochemical assays (JAK1, 2, 3 and Tyk2) were carried in a common kinase reaction buffer (50 mM HEPES, pH 7.5, 0.01%...
Ligand InfoPC cidPC sid
In DepthDetails US Patent
TargetTyrosine-protein kinase JAK1(Homo sapiens (Human))
Theravance Biopharma R&D Ip
US Patent
LigandPNGBDBM292117(US10100049, Example 14 | US10183942, Example 14-7 ...)
Affinity DataKi: <0.100nM. Assay description: A panel of four LanthaScreen JAK biochemical assays (JAK1, 2, 3 and Tyk2) were carried in a common kinase reaction buffer (50 mM HEPES, pH 7.5, 0.01%...
Ligand InfoPC cidPC sid
In DepthDetails US Patent
TargetTyrosine-protein kinase JAK2(Homo sapiens (Human))
Theravance Biopharma R&D Ip
US Patent
LigandPNGBDBM292117(US10100049, Example 14 | US10183942, Example 14-7 ...)
Affinity DataKi: <0.100nM. Assay description: A panel of four LanthaScreen JAK biochemical assays (JAK1, 2, 3 and Tyk2) were carried in a common kinase reaction buffer (50 mM HEPES, pH 7.5, 0.01%...
Ligand InfoPC cidPC sid
In DepthDetails US Patent
TargetTyrosine-protein kinase JAK1(Homo sapiens (Human))
Theravance Biopharma R&D Ip
US Patent
LigandPNGBDBM292117(US10100049, Example 14 | US10183942, Example 14-7 ...)
Affinity DataKi: <0.100nM. Assay description: A panel of four LanthaScreen JAK biochemical assays (JAK1, 2, 3 and Tyk2) were carried in a common kinase reaction buffer (50 mM HEPES, pH 7.5, 0.01%...
Ligand InfoPC cidPC sid
In DepthDetails US Patent
TargetTyrosine-protein kinase JAK1(Homo sapiens (Human))
Theravance Biopharma R&D Ip
US Patent
LigandPNGBDBM292117(US10100049, Example 14 | US10183942, Example 14-7 ...)
Affinity DataKi: <0.100nM. Assay description: A panel of four LanthaScreen JAK biochemical assays (JAK1, 2, 3 and Tyk2) were carried in a common kinase reaction buffer (50 mM HEPES, pH 7.5, 0.01%...
Ligand InfoPC cidPC sid
In DepthDetails US Patent
TargetTyrosine-protein kinase JAK2(Homo sapiens (Human))
Theravance Biopharma R&D Ip
US Patent
LigandPNGBDBM292117(US10100049, Example 14 | US10183942, Example 14-7 ...)
Affinity DataKi: <0.100nM
Ligand InfoPC cidPC sid
In DepthDetails US Patent
TargetTyrosine-protein kinase JAK1(Homo sapiens (Human))
Theravance Biopharma R&D Ip
US Patent
LigandPNGBDBM292117(US10100049, Example 14 | US10183942, Example 14-7 ...)
Affinity DataKi: <0.100nM. Assay description: A panel of four LanthaScreen JAK biochemical assays (JAK1, 2, 3 and Tyk2) were carried in a common kinase reaction buffer (50 mM HEPES, pH 7.5, 0.01%...
Ligand InfoPC cidPC sid
In DepthDetails US Patent
TargetTyrosine-protein kinase JAK2(Homo sapiens (Human))
Theravance Biopharma R&D Ip
US Patent
LigandPNGBDBM292117(US10100049, Example 14 | US10183942, Example 14-7 ...)
Affinity DataKi: <0.100nM
Ligand InfoPC cidPC sid
In DepthDetails US Patent
TargetTyrosine-protein kinase JAK3(Homo sapiens (Human))
Theravance Biopharma R&D Ip
US Patent
LigandPNGBDBM292117(US10100049, Example 14 | US10183942, Example 14-7 ...)
Affinity DataKi: <0.100nM
Ligand InfoPC cidPC sid
In DepthDetails US Patent
TargetNon-receptor tyrosine-protein kinase TYK2(Homo sapiens (Human))
Theravance Biopharma R&D Ip
US Patent
LigandPNGBDBM292117(US10100049, Example 14 | US10183942, Example 14-7 ...)
Affinity DataKi:  0.550nM. Assay description: A panel of four LanthaScreen JAK biochemical assays (JAK1, 2, 3 and Tyk2) were carried in a common kinase reaction buffer (50 mM HEPES, pH 7.5, 0.01%...
Ligand InfoPC cidPC sid
In DepthDetails US Patent
TargetNon-receptor tyrosine-protein kinase TYK2(Homo sapiens (Human))
Theravance Biopharma R&D Ip
US Patent
LigandPNGBDBM292117(US10100049, Example 14 | US10183942, Example 14-7 ...)
Affinity DataKi:  0.550nM. Assay description: A panel of four LanthaScreen JAK biochemical assays (JAK1, 2, 3 and Tyk2) were carried in a common kinase reaction buffer (50 mM HEPES, pH 7.5, 0.01%...
Ligand InfoPC cidPC sid
In DepthDetails US Patent
TargetTyrosine-protein kinase JAK3(Homo sapiens (Human))
Theravance Biopharma R&D Ip
US Patent
LigandPNGBDBM292117(US10100049, Example 14 | US10183942, Example 14-7 ...)
Affinity DataKi:  0.550nM. Assay description: A panel of four LanthaScreen JAK biochemical assays (JAK1, 2, 3 and Tyk2) were carried in a common kinase reaction buffer (50 mM HEPES, pH 7.5, 0.01%...
Ligand InfoPC cidPC sid
In DepthDetails US Patent
TargetTyrosine-protein kinase JAK3(Homo sapiens (Human))
Theravance Biopharma R&D Ip
US Patent
LigandPNGBDBM292117(US10100049, Example 14 | US10183942, Example 14-7 ...)
Affinity DataKi:  0.550nM. Assay description: A panel of four LanthaScreen JAK biochemical assays (JAK1, 2, 3 and Tyk2) were carried in a common kinase reaction buffer (50 mM HEPES, pH 7.5, 0.01%...
Ligand InfoPC cidPC sid
In DepthDetails US Patent
TargetTyrosine-protein kinase JAK3(Homo sapiens (Human))
Theravance Biopharma R&D Ip
US Patent
LigandPNGBDBM292117(US10100049, Example 14 | US10183942, Example 14-7 ...)
Affinity DataKi:  0.550nMpH: 7.5Assay Description:A panel of four LanthaScreen JAK biochemical assays (JAKL 2, 3 and Tyk2) were carried in a common kinase reaction buffer (50 mM HEPES, pH 7.5, 0.01% ...
Ligand InfoPC cidPC sid
In DepthDetails US Patent
TargetNon-receptor tyrosine-protein kinase TYK2(Homo sapiens (Human))
Theravance Biopharma R&D Ip
US Patent
LigandPNGBDBM292117(US10100049, Example 14 | US10183942, Example 14-7 ...)
Affinity DataKi:  0.550nMpH: 7.5Assay Description:A panel of four LanthaScreen JAK biochemical assays (JAKL 2, 3 and Tyk2) were carried in a common kinase reaction buffer (50 mM HEPES, pH 7.5, 0.01% ...
Ligand InfoPC cidPC sid
In DepthDetails US Patent
TargetTyrosine-protein kinase JAK3(Homo sapiens (Human))
Theravance Biopharma R&D Ip
US Patent
LigandPNGBDBM292117(US10100049, Example 14 | US10183942, Example 14-7 ...)
Affinity DataKi:  0.550nM. Assay description: All of the compounds of Examples 1 to 16 and Tables 1 to 19 were tested in one or more of the assays described above. In the following tables, for th...
Ligand InfoPC cidPC sid
In DepthDetails US Patent
TargetTyrosine-protein kinase JAK3(Homo sapiens (Human))
Theravance Biopharma R&D Ip
US Patent
LigandPNGBDBM292117(US10100049, Example 14 | US10183942, Example 14-7 ...)
Affinity DataKi:  0.550nM. Assay description: A panel of four LanthaScreen JAK biochemical assays (JAK1, 2, 3 and Tyk2) were carried in a common kinase reaction buffer (50 mM HEPES, pH 7.5, 0.01%...
Ligand InfoPC cidPC sid
In DepthDetails US Patent
TargetNon-receptor tyrosine-protein kinase TYK2(Homo sapiens (Human))
Theravance Biopharma R&D Ip
US Patent
LigandPNGBDBM292117(US10100049, Example 14 | US10183942, Example 14-7 ...)
Affinity DataKi:  0.550nM
Ligand InfoPC cidPC sid
In DepthDetails US Patent
TargetTyrosine-protein kinase JAK3(Homo sapiens (Human))
Theravance Biopharma R&D Ip
US Patent
LigandPNGBDBM292117(US10100049, Example 14 | US10183942, Example 14-7 ...)
Affinity DataKi:  0.550nM
Ligand InfoPC cidPC sid
In DepthDetails US Patent
TargetNon-receptor tyrosine-protein kinase TYK2(Homo sapiens (Human))
Theravance Biopharma R&D Ip
US Patent
LigandPNGBDBM292117(US10100049, Example 14 | US10183942, Example 14-7 ...)
Affinity DataKi:  0.550nM. Assay description: All of the compounds of Examples 1 to 16 and Tables 1 to 19 were tested in one or more of the assays described above. In the following tables, for th...
Ligand InfoPC cidPC sid
In DepthDetails US Patent
TargetNon-receptor tyrosine-protein kinase TYK2(Homo sapiens (Human))
Theravance Biopharma R&D Ip
US Patent
LigandPNGBDBM292117(US10100049, Example 14 | US10183942, Example 14-7 ...)
Affinity DataKi:  0.550nM. Assay description: A panel of four LanthaScreen JAK biochemical assays (JAK1, 2, 3 and Tyk2) were carried in a common kinase reaction buffer (50 mM HEPES, pH 7.5, 0.01%...
Ligand InfoPC cidPC sid
In DepthDetails US Patent
TargetNon-receptor tyrosine-protein kinase TYK2(Homo sapiens (Human))
Theravance Biopharma R&D Ip
US Patent
LigandPNGBDBM292117(US10100049, Example 14 | US10183942, Example 14-7 ...)
Affinity DataKi:  0.660nM. Assay description: A panel of four LanthaScreen JAK biochemical assays (JAK1, 2, 3 and Tyk2) were carried in a common kinase reaction buffer (50 mM HEPES, pH 7.5, 0.01%...
Ligand InfoPC cidPC sid
In DepthDetails US Patent
TargetNon-receptor tyrosine-protein kinase TYK2(Homo sapiens (Human))
Theravance Biopharma R&D Ip
US Patent
LigandPNGBDBM292117(US10100049, Example 14 | US10183942, Example 14-7 ...)
Affinity DataKi:  0.660nM
Ligand InfoPC cidPC sid
In DepthDetails US Patent
TargetNon-receptor tyrosine-protein kinase TYK2(Homo sapiens (Human))
Theravance Biopharma R&D Ip
US Patent
LigandPNGBDBM292117(US10100049, Example 14 | US10183942, Example 14-7 ...)
Affinity DataKi:  0.660nM. Assay description: A panel of four LanthaScreen JAK biochemical assays (JAK1, 2, 3 and Tyk2) were carried in a common kinase reaction buffer (50 mM HEPES, pH 7.5, 0.01%...
Ligand InfoPC cidPC sid
In DepthDetails US Patent