BDBM292189 US10100057, Example 44::US11046702, Example 44::US9745310, Example 44
SMILES Nc1ccccc1-c1cnc2nc(COc3cccc(F)c3)cn2c1
InChI Key InChIKey=XRDPHVQAYCYOLT-UHFFFAOYSA-N
Data  3 EC50
  Tab Delimited (TSV)   2D SDfile   Computed 3D by Vconf -m prep SDfile
Find this compound or compounds like it in BindingDB:
Activity Spreadsheet -- Enzyme Inhibition Constant Data from BindingDB
Found 3 hits for monomerid = 292189
TargetMetabotropic glutamate receptor 5(Homo sapiens (Human))
Sk Biopharmaceuticals
US Patent
LigandPNGBDBM292189(US10100057, Example 44 | US11046702, Example 44 | ...)
Affinity DataEC50:  300nMT: 2°C. Assay description: Ca2+ (calcium) influx assay is an experiment for measuring the activity of a positive allosteric modulator of mGluR5 receptor in which human mGluR5 r...
Ligand InfoPC cidPC sid
In DepthDetails US Patent
TargetMetabotropic glutamate receptor 5(Homo sapiens (Human))
Sk Biopharmaceuticals
US Patent
LigandPNGBDBM292189(US10100057, Example 44 | US11046702, Example 44 | ...)
Affinity DataEC50:  300nM. Assay description: Ca2+ (calcium) influx assay is an experiment for measuring the activity of a positive allosteric modulator of mGluR5 receptor in which human mGluR5 r...
Ligand InfoPC cidPC sid
In DepthDetails US Patent
TargetMetabotropic glutamate receptor 5(Homo sapiens (Human))
Sk Biopharmaceuticals
US Patent
LigandPNGBDBM292189(US10100057, Example 44 | US11046702, Example 44 | ...)
Affinity DataEC50:  300nM. Assay description: Ca2+ (calcium) influx assay is an experiment for measuring the activity of a positive allosteric modulator of mGluR5 receptor in which human mGluR5 r...
Ligand InfoPC cidPC sid
In DepthDetails US Patent