BDBM292201 US10100057, Example 56::US11046702, Example 56::US9745310, Example 56
SMILES Fc1ccc(OCc2cn3cc(cnc3n2)-c2ccccc2)cc1
InChI Key InChIKey=UNNDYWCCPOTOJI-UHFFFAOYSA-N
Data  3 EC50
  Tab Delimited (TSV)   2D SDfile   Computed 3D by Vconf -m prep SDfile
Find this compound or compounds like it in BindingDB:
Activity Spreadsheet -- Enzyme Inhibition Constant Data from BindingDB
Found 3 hits for monomerid = 292201
TargetMetabotropic glutamate receptor 5(Homo sapiens (Human))
Sk Biopharmaceuticals
US Patent
LigandPNGBDBM292201(US10100057, Example 56 | US11046702, Example 56 | ...)
Affinity DataEC50:  300nMT: 2°C. Assay description: Ca2+ (calcium) influx assay is an experiment for measuring the activity of a positive allosteric modulator of mGluR5 receptor in which human mGluR5 r...
Ligand InfoPC cidPC sid
In DepthDetails US Patent
TargetMetabotropic glutamate receptor 5(Homo sapiens (Human))
Sk Biopharmaceuticals
US Patent
LigandPNGBDBM292201(US10100057, Example 56 | US11046702, Example 56 | ...)
Affinity DataEC50:  300nM. Assay description: Ca2+ (calcium) influx assay is an experiment for measuring the activity of a positive allosteric modulator of mGluR5 receptor in which human mGluR5 r...
Ligand InfoPC cidPC sid
In DepthDetails US Patent
TargetMetabotropic glutamate receptor 5(Homo sapiens (Human))
Sk Biopharmaceuticals
US Patent
LigandPNGBDBM292201(US10100057, Example 56 | US11046702, Example 56 | ...)
Affinity DataEC50:  300nM. Assay description: Ca2+ (calcium) influx assay is an experiment for measuring the activity of a positive allosteric modulator of mGluR5 receptor in which human mGluR5 r...
Ligand InfoPC cidPC sid
In DepthDetails US Patent