BDBM292261 US10100057, Example 116::US11046702, Example 116::US9745310, Example 116
SMILES Cc1cc(F)ccc1-c1cnc2nc(COc3cc(F)ccn3)cn2c1
InChI Key InChIKey=OTSWJPKLSPJLGQ-UHFFFAOYSA-N
Data  3 EC50
  Tab Delimited (TSV)   2D SDfile   Computed 3D by Vconf -m prep SDfile
Find this compound or compounds like it in BindingDB:
Activity Spreadsheet -- Enzyme Inhibition Constant Data from BindingDB
Found 3 hits for monomerid = 292261
TargetMetabotropic glutamate receptor 5(Homo sapiens (Human))
Sk Biopharmaceuticals
US Patent
LigandPNGBDBM292261(US10100057, Example 116 | US11046702, Example 116 ...)
Affinity DataEC50: <100nMT: 2°C. Assay description: Ca2+ (calcium) influx assay is an experiment for measuring the activity of a positive allosteric modulator of mGluR5 receptor in which human mGluR5 r...
Ligand InfoPC cidPC sid
In DepthDetails US Patent
TargetMetabotropic glutamate receptor 5(Homo sapiens (Human))
Sk Biopharmaceuticals
US Patent
LigandPNGBDBM292261(US10100057, Example 116 | US11046702, Example 116 ...)
Affinity DataEC50: <100nM. Assay description: Ca2+ (calcium) influx assay is an experiment for measuring the activity of a positive allosteric modulator of mGluR5 receptor in which human mGluR5 r...
Ligand InfoPC cidPC sid
In DepthDetails US Patent
TargetMetabotropic glutamate receptor 5(Homo sapiens (Human))
Sk Biopharmaceuticals
US Patent
LigandPNGBDBM292261(US10100057, Example 116 | US11046702, Example 116 ...)
Affinity DataEC50: <100nM. Assay description: Ca2+ (calcium) influx assay is an experiment for measuring the activity of a positive allosteric modulator of mGluR5 receptor in which human mGluR5 r...
Ligand InfoPC cidPC sid
In DepthDetails US Patent