BDBM8959 (2-Mercaptoethyl)trimethylammonium iodide acetate::ATC::Acetylthiocholine::[2-(acetylsulfanyl)ethyl]trimethylazanium iodide::acetylthiocholine chloride::acetylthiocholine iodide
SMILES CC(=O)SCC[N+](C)(C)C
InChI Key InChIKey=GFFIJCYHQYHUHB-UHFFFAOYSA-N
Data  1 KI
PDB links: 6 PDB IDs match this monomer.
  Tab Delimited (TSV)   2D SDfile   Computed 3D by Vconf -m prep SDfile
Find this compound or compounds like it in BindingDB:
Activity Spreadsheet -- Enzyme Inhibition Constant Data from BindingDB
Found 1 hit for monomerid = 8959
TargetNeuronal acetylcholine receptor subunit alpha-4(Homo sapiens (Human))
Barrow Neurological Institute
Curated by PDSP Ki Database
LigandPNGBDBM8959((2-Mercaptoethyl)trimethylammonium iodide acetate ...)
Affinity DataKi:  170nM
In DepthDetails ArticlePubMed