BDBM29776 bicyclic sulfonamide analogue, 14
SMILES CCNc1cc(cc2N(C)S(=O)(=O)CCCc12)C(=O)N[C@@H](Cc1ccccc1)[C@H](O)CNC1CCOCC1
InChI Key InChIKey=KTXBXDPQEZZPTQ-AHKZPQOWSA-N
Data  3 IC50
  Tab Delimited (TSV)   2D SDfile   Computed 3D by Vconf -m prep SDfile
Find this compound or compounds like it in BindingDB:
Activity Spreadsheet -- Enzyme Inhibition Constant Data from BindingDB
Found 3 hits for monomerid = 29776
TargetBeta-secretase 1(Homo sapiens (Human))
Gsk
LigandPNGBDBM29776(bicyclic sulfonamide analogue, 14)
Affinity DataIC50:  190nMpH: 4.5 T: 2°C. Assay description: Enzyme activity and inhibition were assayed using a fluorescent FAM-[SEVNLDAEFK]-TAMRA substrate. Control reactions with no enzyme were included in e...
In DepthDetails ArticlePubMed
TargetCathepsin D(Homo sapiens (Human))
Gsk
LigandPNGBDBM29776(bicyclic sulfonamide analogue, 14)
Affinity DataIC50:  4.10E+3nM. Assay description: Enzyme activity and inhibition were assayed using a fluorescent FAM-[SEVNLDAEFK]-TAMRA substrate. Control reactions with no enzyme were included in e...
In DepthDetails ArticlePubMed
TargetBeta-secretase 2(Homo sapiens (Human))
Gsk
LigandPNGBDBM29776(bicyclic sulfonamide analogue, 14)
Affinity DataIC50:  1.87E+4nM. Assay description: Enzyme activity and inhibition were assayed using a fluorescent FAM-[SEVNLDAEFK]-TAMRA substrate. Control reactions with no enzyme were included in e...
In DepthDetails ArticlePubMed