BDBM299211 US10125148, Example 8
SMILES COc1ccc2O[C@@H](C)CCCCCOC3(C)CCN(CC3)c3c([C@H](OC(C)(C)C)C(O)=O)c(C)nc4cc(nn34)-c3cccc(c3)-c2c1
InChI Key InChIKey=KZNTZNWBIKOOBA-LHAPQZOASA-N
Data  1 EC50
  Tab Delimited (TSV)   2D SDfile   Computed 3D by Vconf -m prep SDfile
Find this compound or compounds like it in BindingDB:
Activity Spreadsheet -- Enzyme Inhibition Constant Data from BindingDB
Found 1 hit for monomerid = 299211
TargetEnvelope glycoprotein gp160(Human immunodeficiency virus type 1 (isolate BRU/L...)
Viiv Healthcare UK (NO.5)
US Patent
LigandPNGBDBM299211(US10125148, Example 8)
Affinity DataEC50:  5nM. Assay description: Inhibition of HIV replication. A recombinant NL-Rluc virus was constructed in which a section of the nef gene from NL4-3 was replaced with the Renill...
Ligand InfoPC cidPC sid
In DepthDetails US Patent