BDBM300694 4-(cyclopropyloxy)-N-[5-(2- methylphenyl)-1,3,4-thiadiazol- 2-yl]-3-{[(4-methylpiperazin-1- yl)acetyl]amino}benzamide::US10130633, Example 264
SMILES CN1CCN(CC(=O)Nc2cc(ccc2OC2CC2)C(=O)Nc2nnc(s2)-c2ccccc2C)CC1
InChI Key InChIKey=OTVIQSCDOOZODQ-UHFFFAOYSA-N
Data  2 IC50
  Tab Delimited (TSV)   2D SDfile   Computed 3D by Vconf -m prep SDfile
Find this compound or compounds like it in BindingDB:
Activity Spreadsheet -- Enzyme Inhibition Constant Data from BindingDB
Found 2 hits for monomerid = 300694
TargetProtein Wnt-3a(Homo sapiens (Human))
Bayer Pharma Aktiengesellschaft
US Patent
LigandPNGBDBM300694(4-(cyclopropyloxy)-N-[5-(2- methylphenyl)-1,3,4-th...)
Affinity DataIC50: >5.00E+4nM. Assay description: In preparation of the assay, the two cell lines were plated 24 hours before at 10000 cells per well of a 384 micro titre plate (MTP) in 30 μL gr...
Ligand InfoPC cidPC sid
In DepthDetails US Patent
TargetProtein Wnt-3a(Homo sapiens (Human))
Bayer Pharma Aktiengesellschaft
US Patent
LigandPNGBDBM300694(4-(cyclopropyloxy)-N-[5-(2- methylphenyl)-1,3,4-th...)
Affinity DataIC50:  255nM. Assay description: In preparation of the assay, the two cell lines were plated 24 hours before at 10000 cells per well of a 384 micro titre plate (MTP) in 30 μL gr...
Ligand InfoPC cidPC sid
In DepthDetails US Patent