BDBM301685 US10131692, Compound 17
SMILES CCc1ccc(C[C@@H]2NC(=O)CCSCC[C@H](NC(=O)[C@H](CC(N)=O)NC(=O)[C@@H](NC(=O)[C@H](Cc3cccs3)NC2=O)C(C)C)C(=O)N2CCC[C@H]2C(=O)N[C@@H](CO)CCCNC(N)=N)cc1
InChI Key InChIKey=CCOKDYRDUMUKDI-USVUHUQMSA-N
Data  2 EC50
  Tab Delimited (TSV)   2D SDfile   Computed 3D by Vconf -m prep SDfile
Find this compound or compounds like it in BindingDB:
Activity Spreadsheet -- Enzyme Inhibition Constant Data from BindingDB
Found 2 hits for monomerid = 301685
TargetVasopressin V1b receptor(Homo sapiens (Human))
Ferring
US Patent
LigandPNGBDBM301685(US10131692, Compound 17)
Affinity DataEC50: >1.00E+7nM. Assay description: To determine selectivity, compounds were tested in luciferase-based transcriptional reporter gene assays expressing the human V1b receptor (hV1bR). A...
Ligand InfoPC cidPC sid
In DepthDetails US Patent
TargetVasopressin V2 receptor(Homo sapiens (Human))
Ferring
US Patent
LigandPNGBDBM301685(US10131692, Compound 17)
Affinity DataEC50:  350nM. Assay description: Agonist activity of compounds on the human V2 receptor (h V2R) was determined in a transcriptional reporter gene assay by transiently transfecting an...
Ligand InfoPC cidPC sid
In DepthDetails US Patent