BDBM302259 US9598415, 171
SMILES CC(C)n1c2nc(ncc2nc(NCc2ccc(cc2)S(=O)(=O)CC#N)c1=O)-c1c(C)ncnc1C1CC1
InChI Key InChIKey=FCWTVUOQURLDLL-UHFFFAOYSA-N
Data  1 IC50
  Tab Delimited (TSV)   2D SDfile   Computed 3D by Vconf -m prep SDfile
Find this compound or compounds like it in BindingDB:
Activity Spreadsheet -- Enzyme Inhibition Constant Data from BindingDB
Found 1 hit for monomerid = 302259
TargetNuclear receptor ROR-gamma(Homo sapiens (Human))
Boehringer Ingelheim International
US Patent
LigandPNGBDBM302259(US9598415, 171)
Affinity DataIC50:  200nM. Assay description: A nuclear receptor transactivation assay is performed to quantitate the ability of test compounds to inhibit RORγ transactivation of a luciferas...
Ligand InfoPC cidPC sid
In DepthDetails US Patent