BDBM302806 US9598423, Example A36
SMILES NC(=O)c1c2CN(CC3(CC(F)(F)C3)n2nc1-c1ccc(F)c(Cl)c1)C(=O)Nc1ccc(cc1)[N+]#[C-]
InChI Key InChIKey=IJKCFFQVMUMGBF-UHFFFAOYSA-N
Data  2 IC50
  Tab Delimited (TSV)   2D SDfile   Computed 3D by Vconf -m prep SDfile
Find this compound or compounds like it in BindingDB:
Activity Spreadsheet -- Enzyme Inhibition Constant Data from BindingDB
Found 2 hits for monomerid = 302806
TargetCasein kinase I isoform delta(Homo sapiens (Human))
Bristol-Myers Squibb
US Patent
LigandPNGBDBM302806(US9598423, Example A36)
Affinity DataIC50: <10nM. Assay description: The kinase assay was performed in V-bottom 384-well plates. The final assay volume was 30 μl prepared from 15 μl additions of enzyme, subst...
Ligand InfoPC cidPC sid
In DepthDetails US Patent
TargetCasein kinase I isoform epsilon(Homo sapiens (Human))
Bristol-Myers Squibb
US Patent
LigandPNGBDBM302806(US9598423, Example A36)
Affinity DataIC50: <10nM. Assay description: The kinase assay was performed in V-bottom 384-well plates. The final assay volume was 30 μl prepared from 15 μl additions of enzyme, subst...
Ligand InfoPC cidPC sid
In DepthDetails US Patent