BDBM303246 2-amino-N-[(3,6- dimethyl-2- pyridyl)methyl]-8- methoxy-quinazoline-4- carboxamide::US10138212, Example 11
SMILES COc1cccc2c(nc(N)nc12)C(=O)NCc1nc(C)ccc1C
InChI Key InChIKey=QYHUCMOECUOQHQ-UHFFFAOYSA-N
Data  1 KI
  Tab Delimited (TSV)   2D SDfile   Computed 3D by Vconf -m prep SDfile
Find this compound or compounds like it in BindingDB:
Activity Spreadsheet -- Enzyme Inhibition Constant Data from BindingDB
Found 1 hit for monomerid = 303246
TargetAdenosine receptor A2a(Homo sapiens (Human))
Merck Sharp & Dohme
US Patent
LigandPNGBDBM303246(2-amino-N-[(3,6- dimethyl-2- pyridyl)methyl]-8- me...)
Affinity DataKi:  0.200nM. Assay description: Binding affinities of compounds of the invention for the human A2a receptor were determined in a competition binding assay using Scintillation Proxim...
Ligand InfoPC cidPC sid
In DepthDetails US Patent