BDBM304031 US10138245, Example 2
SMILES Cc1cnc(C)c2nc(nn12)-c1ccc2[nH]c(nc2c1)-c1ccccc1F
InChI Key InChIKey=NTMFMYRBUMKEOU-UHFFFAOYSA-N
Data  1 IC50
  Tab Delimited (TSV)   2D SDfile   Computed 3D by Vconf -m prep SDfile
Find this compound or compounds like it in BindingDB:
Activity Spreadsheet -- Enzyme Inhibition Constant Data from BindingDB
Found 1 hit for monomerid = 304031
TargetcAMP and cAMP-inhibited cGMP 3',5'-cyclic phosphodiesterase 10A(Homo sapiens (Human))
Celon Pharma
US Patent
LigandPNGBDBM304031(US10138245, Example 2)
Affinity DataIC50:  37nM. Assay description: Recombinant human phosphodiesterase 10A (PDE10A) purified to homogeneity from Sf9 cells overexpressing PDE10A gene (GenBank/EMBL accession number: NM...
Ligand InfoPC cidPC sid
In DepthDetails US Patent