BDBM30490 1,1-dioxoisothiazole analog., 34
SMILES CC(C)(C)[C@@H]1N(Cc2ccc(F)c(Cl)c2)C(=O)C(C1=O)=C1NS(=O)(=O)c2c1cccc2CNS(C)(=O)=O
InChI Key InChIKey=RFRAETUULYWXQX-JOCHJYFZSA-N
Data  1 IC50  1 EC50
PDB links: 1 PDB ID matches this monomer.
  Tab Delimited (TSV)   2D SDfile   Computed 3D by Vconf -m prep SDfile
Find this compound or compounds like it in BindingDB:
Activity Spreadsheet -- Enzyme Inhibition Constant Data from BindingDB
Found 1 hit for monomerid = 30490
TargetGenome polyprotein(Hepatitis C virus genotype 1b (isolate BK) (HCV))
Anadys Pharmaceuticals
LigandPNGBDBM30490(1,1-dioxoisothiazole analog., 34)
Affinity DataIC50: <10nM EC50:  70nMpH: 7.5 T: 2°C. Assay description: Assays were performed in a 96-well streptavidin-coated Flash-Plate using enzyme, RNA substrate, and [alpha-33P]GTP/GTP with inhibitor concentration v...