BDBM30508 5,6-Dihydro-1H-pyridin-2-one, 4h
SMILES CC(C)(C)CCN1C2CCCC2C(=O)C(C1=O)C1=Nc2ccc(NS(C)(=O)=O)cc2S(=O)(=O)N1
InChI Key InChIKey=VNPGKACHYOXFDZ-UHFFFAOYSA-N
Data  2 IC50  1 EC50
  Tab Delimited (TSV)   2D SDfile   Computed 3D by Vconf -m prep SDfile
Find this compound or compounds like it in BindingDB:
Activity Spreadsheet -- Enzyme Inhibition Constant Data from BindingDB
Found 2 hits for monomerid = 30508
TargetGenome polyprotein(Hepatitis C virus (HCV genotype 1a, isolate H))
Anadys Pharmaceuticals
LigandPNGBDBM30508(5,6-Dihydro-1H-pyridin-2-one, 4h)
Affinity DataIC50: <25nM. Assay description: Assays were performed in a 96-well streptavidin-coated Flash-Plate using enzyme (NS5B H77 1a), RNA substrate, and [alpha-33P]GTP/GTP with inhibitor c...
In DepthDetails ArticlePubMed
TargetGenome polyprotein(Hepatitis C virus genotype 1b (isolate BK) (HCV))
Anadys Pharmaceuticals
LigandPNGBDBM30508(5,6-Dihydro-1H-pyridin-2-one, 4h)
Affinity DataIC50: <10nM EC50:  24nMpH: 7.5 T: 2°C. Assay description: Assays were performed in a 96-well streptavidin-coated Flash-Plate using enzyme, RNA substrate, and [alpha-33P]GTP/GTP with inhibitor concentration v...
In DepthDetails ArticlePubMed