BDBM309895 1- ((benzo[d][1,3]dioxol- 5-yl)methyl)-3-(1H- benzo[d]imidazol-5- yl)thiourea::US9656991, 9
SMILES S=C(NCc1ccc2OCOc2c1)Nc1ccc2[nH]cnc2c1
InChI Key InChIKey=PUZWIEPWWZTJCZ-UHFFFAOYSA-N
Data  1 KI  1 IC50
  Tab Delimited (TSV)   2D SDfile   Computed 3D by Vconf -m prep SDfile
Find this compound or compounds like it in BindingDB:
Activity Spreadsheet -- Enzyme Inhibition Constant Data from BindingDB
Found 2 hits for monomerid = 309895
TargetGlutaminyl-peptide cyclotransferase(Homo sapiens (Human))
Probiodrug
US Patent
LigandPNGBDBM309895(1- ((benzo[d][1,3]dioxol- 5-yl)methyl)-3-(1H- benz...)
Affinity DataKi:  544nM. Assay description: This novel assay was used to determine the kinetic parameters for most of the QC substrates. QC activity was analyzed spectrophotometrically using a ...
Ligand InfoPC cidPC sid
In DepthDetails US Patent
TargetGlutaminyl-peptide cyclotransferase(Homo sapiens (Human))
Probiodrug
US Patent
LigandPNGBDBM309895(1- ((benzo[d][1,3]dioxol- 5-yl)methyl)-3-(1H- benz...)
Affinity DataIC50:  3.24E+3nM. Assay description: This novel assay was used to determine the kinetic parameters for most of the QC substrates. QC activity was analyzed spectrophotometrically using a ...
Ligand InfoPC cidPC sid
In DepthDetails US Patent