BDBM309922 1-mesityl-3-(3-(4- methyl-1H-imidazol- 1-yl)propyl)thiourea::US9656991, 36
SMILES Cc1cn(CCCNC(=S)Nc2c(C)cc(C)cc2C)cn1
InChI Key InChIKey=LQNMSKDIWIZRBH-UHFFFAOYSA-N
Data  1 KI  1 IC50
  Tab Delimited (TSV)   2D SDfile   Computed 3D by Vconf -m prep SDfile
Find this compound or compounds like it in BindingDB:
Activity Spreadsheet -- Enzyme Inhibition Constant Data from BindingDB
Found 2 hits for monomerid = 309922
TargetGlutaminyl-peptide cyclotransferase(Homo sapiens (Human))
Probiodrug
US Patent
LigandPNGBDBM309922(1-mesityl-3-(3-(4- methyl-1H-imidazol- 1-yl)propyl...)
Affinity DataKi:  412nM. Assay description: This novel assay was used to determine the kinetic parameters for most of the QC substrates. QC activity was analyzed spectrophotometrically using a ...
Ligand InfoPC cidPC sid
In DepthDetails US Patent
TargetGlutaminyl-peptide cyclotransferase(Homo sapiens (Human))
Probiodrug
US Patent
LigandPNGBDBM309922(1-mesityl-3-(3-(4- methyl-1H-imidazol- 1-yl)propyl...)
Affinity DataIC50:  4.22E+3nM. Assay description: This novel assay was used to determine the kinetic parameters for most of the QC substrates. QC activity was analyzed spectrophotometrically using a ...
Ligand InfoPC cidPC sid
In DepthDetails US Patent