BDBM309938 1-(3,4,5-trimethoxy- benzyl)-3-(1H- benzo[d]imidazol-5- yl)thiourea::US9656991, 52
SMILES COc1cc(CNC(=S)Nc2ccc3[nH]cnc3c2)cc(OC)c1OC
InChI Key InChIKey=VRCGXEZJKJJCBJ-UHFFFAOYSA-N
Data  1 KI  1 IC50
  Tab Delimited (TSV)   2D SDfile   Computed 3D by Vconf -m prep SDfile
Find this compound or compounds like it in BindingDB:
Activity Spreadsheet -- Enzyme Inhibition Constant Data from BindingDB
Found 2 hits for monomerid = 309938
TargetGlutaminyl-peptide cyclotransferase(Homo sapiens (Human))
Probiodrug
US Patent
LigandPNGBDBM309938(1-(3,4,5-trimethoxy- benzyl)-3-(1H- benzo[d]imidaz...)
Affinity DataKi:  166nM. Assay description: This novel assay was used to determine the kinetic parameters for most of the QC substrates. QC activity was analyzed spectrophotometrically using a ...
Ligand InfoPC cidPC sid
In DepthDetails US Patent
TargetGlutaminyl-peptide cyclotransferase(Homo sapiens (Human))
Probiodrug
US Patent
LigandPNGBDBM309938(1-(3,4,5-trimethoxy- benzyl)-3-(1H- benzo[d]imidaz...)
Affinity DataIC50:  1.10E+3nM. Assay description: This novel assay was used to determine the kinetic parameters for most of the QC substrates. QC activity was analyzed spectrophotometrically using a ...
Ligand InfoPC cidPC sid
In DepthDetails US Patent