BDBM31001 (4-Amino-furazan-3-yl)-(4-methyl-piperazin-1-yl)-methanone oxime::(4E)-4-[(4-methyl-1-piperazinyl)-nitrosomethylidene]-1,2,5-oxadiazol-3-amine::(4E)-4-[(4-methylpiperazin-1-yl)-nitroso-methylidene]-1,2,5-oxadiazol-3-amine::(4E)-4-[(4-methylpiperazin-1-yl)-nitrosomethylidene]-1,2,5-oxadiazol-3-amine::MLS000070315::SMR000001272::[(4E)-4-[(4-methylpiperazino)-nitroso-methylene]furazan-3-yl]amine::cid_6364821
SMILES CN1CCN(CC1)C(N=O)c1nonc1N
InChI Key InChIKey=XJSKATRQVWDVSG-UHFFFAOYSA-N
Data  3 EC50
  Tab Delimited (TSV)   2D SDfile   Computed 3D by Vconf -m prep SDfile
Find this compound or compounds like it in BindingDB:
Activity Spreadsheet -- Enzyme Inhibition Constant Data from BindingDB
Found 3 hits for monomerid = 31001
Target5-hydroxytryptamine receptor 1A(Homo sapiens (Human))
The Scripps Research Institute Molecular Screening Center
Curated by PubChem BioAssay
LigandPNGBDBM31001((4-Amino-furazan-3-yl)-(4-methyl-piperazin-1-yl)-m...)
Affinity DataEC50:  5.00E+4nMpH: 7.4 T: 2°C. Assay description: A cell line containing the human 5-HT1a receptor, the promiscuous G-alpha-15 protein (Ga15) as well as the beta-lactamase (BLA) reporter-gene under c...
Ligand InfoPC cidPC sid
In DepthDetails PCBioAssay
TargetSphingosine 1-phosphate receptor 3(Homo sapiens (Human))
The Scripps Research Institute Molecular Screening Center
Curated by PubChem BioAssay
LigandPNGBDBM31001((4-Amino-furazan-3-yl)-(4-methyl-piperazin-1-yl)-m...)
Affinity DataEC50: >4.00E+4nM. Assay description: External Assay ID: S1P3_EC50_CS_5HT1e_Agonist Name: S1P3 Dose Response Assay Counterscreen for 5-Hydroxytryptamine(Serotonin) Receptor Subtype 1E ...
Ligand InfoPC cidPC sid
In DepthDetails PCBioAssay
Target5-hydroxytryptamine receptor 1E(Homo sapiens (Human))
The Scripps Research Institute Molecular Screening Center
Curated by PubChem BioAssay
LigandPNGBDBM31001((4-Amino-furazan-3-yl)-(4-methyl-piperazin-1-yl)-m...)
Affinity DataEC50:  1.17E+3nMpH: 7.4 T: 2°C. Assay description: The CHO cell line was cultured in T-175 sq cm Corning flasks (part 431080) at 37 deg C and 95% RH. The HTS assay began by dispensing 10 microliters o...
Ligand InfoPC cidPC sid
In DepthDetails PCBioAssay