BDBM31015 1,5-dimethyl-2-phenyl-4-[[4-[3-(trifluoromethyl)phenyl]-1-piperazinyl]methyl]-3-pyrazolone::1,5-dimethyl-2-phenyl-4-[[4-[3-(trifluoromethyl)phenyl]piperazin-1-yl]methyl]pyrazol-3-one::1,5-dimethyl-2-phenyl-4-[[4-[3-(trifluoromethyl)phenyl]piperazino]methyl]-3-pyrazolin-3-one::MLS000057668::SMR000067764::cid_2523521
SMILES Cc1c(CN2CCN(CC2)c2cccc(c2)C(F)(F)F)c(=O)n(-c2ccccc2)n1C
InChI Key InChIKey=TWCSZWPHPHTDJV-UHFFFAOYSA-N
Data  3 EC50
  Tab Delimited (TSV)   2D SDfile   Computed 3D by Vconf -m prep SDfile
Find this compound or compounds like it in BindingDB:
Activity Spreadsheet -- Enzyme Inhibition Constant Data from BindingDB
Found 3 hits for monomerid = 31015
Target5-hydroxytryptamine receptor 1A(Homo sapiens (Human))
The Scripps Research Institute Molecular Screening Center
Curated by PubChem BioAssay
LigandPNGBDBM31015(1,5-dimethyl-2-phenyl-4-[[4-[3-(trifluoromethyl)ph...)
Affinity DataEC50:  5.00E+4nMpH: 7.4 T: 2°C. Assay description: A cell line containing the human 5-HT1a receptor, the promiscuous G-alpha-15 protein (Ga15) as well as the beta-lactamase (BLA) reporter-gene under c...
In DepthDetails PCBioAssay
TargetSphingosine 1-phosphate receptor 3(Homo sapiens (Human))
The Scripps Research Institute Molecular Screening Center
Curated by PubChem BioAssay
LigandPNGBDBM31015(1,5-dimethyl-2-phenyl-4-[[4-[3-(trifluoromethyl)ph...)
Affinity DataEC50: >4.00E+4nM. Assay description: External Assay ID: S1P3_EC50_CS_5HT1e_Agonist Name: S1P3 Dose Response Assay Counterscreen for 5-Hydroxytryptamine(Serotonin) Receptor Subtype 1E ...
In DepthDetails PCBioAssay
Target5-hydroxytryptamine receptor 1E(Homo sapiens (Human))
The Scripps Research Institute Molecular Screening Center
Curated by PubChem BioAssay
LigandPNGBDBM31015(1,5-dimethyl-2-phenyl-4-[[4-[3-(trifluoromethyl)ph...)
Affinity DataEC50:  1.84E+3nMpH: 7.4 T: 2°C. Assay description: The CHO cell line was cultured in T-175 sq cm Corning flasks (part 431080) at 37 deg C and 95% RH. The HTS assay began by dispensing 10 microliters o...
In DepthDetails PCBioAssay