BDBM31092 US8853193, 32-33
SMILES Cc1c(sc2ncnc(Nc3ccc(F)cc3OCCO)c12)C(=O)NCCO
InChI Key InChIKey=KDKUVYLMPJIGKA-UHFFFAOYSA-N
Data  1 IC50
  Tab Delimited (TSV)   2D SDfile   Computed 3D by Vconf -m prep SDfile
Find this compound or compounds like it in BindingDB:
Activity Spreadsheet -- Enzyme Inhibition Constant Data from BindingDB
Found 1 hit for monomerid = 31092
TargetMAP kinase-interacting serine/threonine-protein kinase 2(Homo sapiens (Human))
Boehringer Ingelheim International
US Patent
LigandPNGBDBM31092(US8853193, 32-33)
Affinity DataIC50:  65nMpH: 7.4 T: 2°C. Assay description: Inhibition of kinase activity of Mnk1 and Mnk2a was assessed with the same assay system, using pre-activated GST-Mnk1 or GST-Mnk2a, respectively. The...
In DepthDetails US Patent