BDBM31305 1,4-benzodiazepine-2,5-dione, 12b::BMCL163310 Compound 19
SMILES C[C@@H](N1[C@@H](c2ccc(Cl)cc2)C(=O)N(CCCCC(O)=O)c2ccc(I)cc2C1=O)c1ccc(Cl)cc1
InChI Key InChIKey=VLOPNYYNACVDTC-QUGAMOGWSA-N
Data  2 IC50
  Tab Delimited (TSV)   2D SDfile   Computed 3D by Vconf -m prep SDfile
Find this compound or compounds like it in BindingDB:
Activity Spreadsheet -- Enzyme Inhibition Constant Data from BindingDB
Found 2 hits for monomerid = 31305
TargetE3 ubiquitin-protein ligase Mdm2(Homo sapiens (Human))
Johnson & Johnson Pharmaceutical
LigandPNGBDBM31305(1,4-benzodiazepine-2,5-dione, 12b | BMCL163310 Com...)
Affinity DataIC50:  700nMpH: 7.5 T: 2°C. Assay description: Test compound was incubated for 15 minutes with 30 nM peptide fluorescein-FMDYWEGLN (Fl 9mer) and 120 nM (glycine-HDM2 17-125) in assay buffer. The p...
In DepthDetails ArticlePubMed
TargetE3 ubiquitin-protein ligase Mdm2(Homo sapiens (Human))
Johnson & Johnson Pharmaceutical
LigandPNGBDBM31305(1,4-benzodiazepine-2,5-dione, 12b | BMCL163310 Com...)
Affinity DataIC50:  856nMpH: 7.4 T: 2°C. Assay description: Test compound was incubated for 15 minutes with 30 nM peptide fluorescein-FMDYWEGLN (Fl 9mer) and 120 nM (glycine-HDM2 17-125) in assay buffer. The p...
In DepthDetails ArticlePubMed