BDBM31338 1,4-benzodiazepine-2,5-dione antagonist, 23
SMILES C[C@@H](N1[C@@H](c2ccc(Cl)cc2)C(=O)N(CCCCC(O)=O)c2ccc(cc2C1=O)C#C)c1ccc(Cl)cc1
InChI Key InChIKey=WRGLVOHNHGTKTI-GDJIYFAZSA-N
Data  1 IC50
  Tab Delimited (TSV)   2D SDfile   Computed 3D by Vconf -m prep SDfile
Find this compound or compounds like it in BindingDB:
Activity Spreadsheet -- Enzyme Inhibition Constant Data from BindingDB
Found 1 hit for monomerid = 31338
TargetE3 ubiquitin-protein ligase Mdm2(Homo sapiens (Human))
Johnson & Johnson Pharmaceutical
LigandPNGBDBM31338(1,4-benzodiazepine-2,5-dione antagonist, 23)
Affinity DataIC50:  710nMpH: 7.5 T: 2°C. Assay description: Test compound was incubated for 15 minutes with 30 nM peptide fluorescein-FMDYWEGLN (Fl 9mer) and 120 nM (glycine-HDM2 17-125) in assay buffer. The p...
In DepthDetails ArticlePubMed