BDBM313533 N-(3-(2-((2- hydroxyethyl)amino)-6- (3-methoxyoxetan-3- yl)pyridin-4-yl)-4- methylphenyl)-4- (trifluoromethyl)picolin- amide::US10167279, Example 154
SMILES COC1(COC1)c1cc(cc(NCCO)n1)-c1cc(NC(=O)c2cc(ccn2)C(F)(F)F)ccc1C
InChI Key InChIKey=GEKOHQGSTMYGTB-UHFFFAOYSA-N
Data  1 IC50
  Tab Delimited (TSV)   2D SDfile   Computed 3D by Vconf -m prep SDfile
Find this compound or compounds like it in BindingDB:
Activity Spreadsheet -- Enzyme Inhibition Constant Data from BindingDB
Found 1 hit for monomerid = 313533
TargetRAF proto-oncogene serine/threonine-protein kinase(Homo sapiens (Human))
Novartis
US Patent
LigandPNGBDBM313533(N-(3-(2-((2- hydroxyethyl)amino)-6- (3-methoxyoxet...)
Affinity DataIC50:  40nM. Assay description: Assay Materials: Assay buffer is 50 mM Tris, pH 7.5, 15 mM MgCl2, 0.01% Bovine Serum Albumin (BSA) and 1 mM dithiothreitol (DTT); Stop buffer is 60 m...
Ligand InfoPC cidPC sid
In DepthDetails US Patent