BDBM31520 Naphthalene and Benzamide Derivative, 5h
SMILES C[C@@H](NC(=O)c1ccccc1C)c1cccc2ccccc12
InChI Key InChIKey=KHDFCIXDDKWNFL-OAHLLOKOSA-N
Data  1 IC50
  Tab Delimited (TSV)   2D SDfile   Computed 3D by Vconf -m prep SDfile
Find this compound or compounds like it in BindingDB:
Activity Spreadsheet -- Enzyme Inhibition Constant Data from BindingDB
Found 1 hit for monomerid = 31520
TargetReplicase polyprotein 1ab [1541-1855](Human SARS coronavirus (SARS-CoV))
Purdue University
LigandPNGBDBM31520(Naphthalene and Benzamide Derivative, 5h)
Affinity DataIC50:  2.30E+3nMpH: 7.5 T: 2°C. Assay description: IC50 values for all inhibitors were determined using a 96-well plate based assay. Reactions were performed in buffer containing RLRGG-AMC, 2% DMSO, a...
In DepthDetails ArticlePubMed